"id","code","next-available","out-of-stock","orderable","Est Arrival Date","Status","Available Quantity","available-qty","free-ship-method","dimensions","ship-alone","flat-ship-rates","origin-zip","number-of-boxes","invalid-ship-methods","upsable","ship-weight","global-free-ship-exclusion","freight-class","outbound-shipping"
111-1-BK-GG,111-1-BK-GG,,0,1,,In Stock,118,118,,33.50''W x 31''D x 29''H,No,,38654 89506,,,,54,Yes,300,**1 Per Box**
111-1-BN-GG,111-1-BN-GG,,0,1,,In Stock,153,153,,33.50''W x 31''D x 29''H,No,,38654 89506,,,,54,Yes,300,**1 Per Box**
111-1-CG-GG,111-1-CG-GG,,0,1,,In Stock,43,43,,33.50''W x 31''D x 29''H,No,,30114,,,,54,Yes,300,**1 Per Box**
111-1-GY-GG,111-1-GY-GG,2021-06-03,1,1,2021-06-03,Back Ordered,0,0,,33.50''W x 31''D x 29''H,No,,30114,,,,54,Yes,300,**1 Per Box**
111-1-WH-GG,111-1-WH-GG,,0,1,,In Stock,26,26,,33.50''W x 31''D x 29''H,No,,38654 89506,,,,54,Yes,300,**1 Per Box**
111-2-BK-GG,111-2-BK-GG,,0,1,,In Stock,58,58,,52''W x 29''D x 29''H,No,,38654 89506,,,,74,Yes,300,**1 Per Box**
111-2-BN-GG,111-2-BN-GG,,0,1,,In Stock,36,36,,52''W x 29''D x 29''H,No,,38654 89506,,,,74,Yes,300,**1 Per Box**
111-2-CG-GG,111-2-CG-GG,,0,1,,In Stock,52,52,,52''W x 29''D x 29''H,No,,30114,,,,74,Yes,300,**1 Per Box**
111-2-GY-GG,111-2-GY-GG,,0,1,,In Stock,40,40,,52''W x 29''D x 29''H,No,,30114,,,,74,Yes,300,**1 Per Box**
111-2-WH-GG,111-2-WH-GG,,0,1,,In Stock,49,49,,52''W x 29''D x 29''H,No,,38654 89506,,,,74,Yes,300,**1 Per Box**
111-3-BK-GG,111-3-BK-GG,2021-04-17,1,1,2021-04-17,Back Ordered,0,0,,72.75''W x 29''D x 29''H,No,,38654 89506,,,,94,Yes,300,**1 Per Box**
111-3-BN-GG,111-3-BN-GG,2021-06-02,1,1,2021-06-02,Back Ordered,0,0,,72.75''W x 29''D x 29''H,No,,38654 89506,,,,94,Yes,300,**1 Per Box**
111-3-CG-GG,111-3-CG-GG,,0,1,,In Stock,24,24,,72.75''W x 29''D x 29''H,No,,30114,,,,94,Yes,300,**1 Per Box**
111-3-GY-GG,111-3-GY-GG,,0,1,,In Stock,15,15,,72.75''W x 29''D x 29''H,No,,30114,,,,94,Yes,300,**1 Per Box**
111-3-WH-GG,111-3-WH-GG,,0,1,,In Stock,5,5,,72.75''W x 29''D x 29''H,No,,38654 89506,,,,94,Yes,300,**1 Per Box**
111-SET-BK-GG,111-SET-BK-GG,2021-06-02,1,1,2021-06-02,Back Ordered,0,0,,33.50'' - 72.75''W x 29'' - 31''D x 29''H,No,,89506 38654,,,,222,Yes,300,**Item Ships in 3 Boxes**
111-SET-BN-GG,111-SET-BN-GG,,1,1,,Back Ordered,0,0,,33.50'' - 72.75''W x 29'' - 31''D x 29''H,No,,89506 38654,,,,222,Yes,300,**Item Ships in 3 Boxes**
111-SET-CG-GG,111-SET-CG-GG,,0,1,,In Stock,17,17,,33.50'' - 72.75''W x 29'' - 31''D x 29''H,No,,30114,,,,222,Yes,300,**Item Ships in 3 Boxes**
111-SET-GY-GG,111-SET-GY-GG,2021-06-03,1,1,2021-06-03,Back Ordered,0,0,,33.50'' - 72.75''W x 29'' - 31''D x 29''H,No,,30114,,,,222,Yes,300,**Item Ships in 3 Boxes**
111-SET-WH-GG,111-SET-WH-GG,,1,1,,Back Ordered,0,0,,33.50'' - 72.75''W x 29'' - 31''D x 29''H,No,,89506 38654,,,,222,Yes,300,**Item Ships in 3 Boxes**
2-CH-182020-24-BK-F-GG,2-CH-182020-24-BK-F-GG,,1,1,,Back Ordered,0,0,,,No,,30114,,,,60,Yes,125,**1 Per Box**
2-CH-182020-24-BK-GG,2-CH-182020-24-BK-GG,,0,1,,In Stock,50,50,,,No,,30114,,,,60,Yes,125,**1 Per Box**
2-CH-182020-24-BN-F-GG,2-CH-182020-24-BN-F-GG,,0,1,,In Stock,14,14,,,No,,30114,,,,60,Yes,125,**1 Per Box**
2-CH-182020-24-BN-GG,2-CH-182020-24-BN-GG,,0,1,,In Stock,60,60,,,No,,30114,,,,60,Yes,125,**1 Per Box**
2-CH-182020-24-DKGY-F-GG,2-CH-182020-24-DKGY-F-GG,,0,1,,In Stock,64,64,,,No,,30114,,,,60,Yes,125,**1 Per Box**
2-CH-182020-24-DKGY-GG,2-CH-182020-24-DKGY-GG,,0,1,,In Stock,54,54,,,No,,30114,,,,60,Yes,125,**Item Ships in 2 Boxes**
2-CH-182020-24-LTGY-F-GG,2-CH-182020-24-LTGY-F-GG,,0,1,,In Stock,84,84,,,No,,30114,,,,60,Yes,125,**1 Per Box**
2-CH-182020-24-LTGY-GG,2-CH-182020-24-LTGY-GG,,0,1,,In Stock,22,22,,,No,,30114,,,,60,Yes,125,**1 Per Box**
2-CH-182020-24-WH-GG,2-CH-182020-24-WH-GG,,1,1,,Back Ordered,0,0,,,No,,30114,,,,60,Yes,125,**1 Per Box**
2-CH-92023-1-BK-G-GG,2-CH-92023-1-BK-G-GG,2021-07-30,1,1,2021-07-30,Back Ordered,0,0,,,No,,30114,,,,45.75,No,125,**1 Per Box**
2-CH-92023-1-WH-G-GG,2-CH-92023-1-WH-G-GG,2021-07-30,1,1,2021-07-30,Back Ordered,0,0,,,No,,30114,,,,45.75,No,125,**1 Per Box**
2-ET-ER18345-24-DB-GG,2-ET-ER18345-24-DB-GG,,0,1,,In Stock,1,1,,,No,,30114,,,,21,Yes,125,**1 Per Box**
2-ET-ER18345-24-GY-GG,2-ET-ER18345-24-GY-GG,,1,1,,Back Ordered,0,0,,,No,,30114,,,,21,Yes,125,**1 Per Box**
2-ET-ER18345-24-LB-GG,2-ET-ER18345-24-LB-GG,2021-04-15,1,1,2021-04-15,Back Ordered,0,0,,,No,,30114,,,,21,Yes,125,**1 Per Box**
2-ET-ER18345-30-DB-GG,2-ET-ER18345-30-DB-GG,,0,1,,In Stock,104,104,,,No,,30114,,,,23,Yes,125,**1 Per Box**
2-ET-ER18345-30-GY-GG,2-ET-ER18345-30-GY-GG,2021-07-09,1,1,2021-07-09,Back Ordered,0,0,,,No,,30114,,,,23,Yes,125,**1 Per Box**
2-ET-ER18345-30-LB-GG,2-ET-ER18345-30-LB-GG,2021-05-14,1,1,2021-05-14,Back Ordered,0,0,,,No,,30114,,,,23,Yes,125,**1 Per Box**
2-ET-SWVLPTO-30-BK-GG,2-ET-SWVLPTO-30-BK-GG,2021-04-15,1,1,2021-04-15,Back Ordered,0,0,,,No,,30114,,,,60,Yes,85,**1 Per Box**
2-ET-SWVLPTO-30-GG,2-ET-SWVLPTO-30-GG,,0,1,,In Stock,54,54,,,No,,30114,,,,60,Yes,85,**1 Per Box**
2-GM-103122SS-BK-GG,2-GM-103122SS-BK-GG,,1,1,,Back Ordered,0,0,,,No,,30114,,,,38.3,Yes,85,**1 Per Box**
2-JJ-092H-GG,2-JJ-092H-GG,,0,1,,In Stock,1,1,,,No,,30114,,,,33,No,250,**2 Per Box**
2-JJ-C14703-BK-GG,2-JJ-C14703-BK-GG,,0,1,,In Stock,211,211,,,No,,30114,,,,86,No,100,**Item Ships in 2 Boxes**
2-JJ-C14703-GY-GG,2-JJ-C14703-GY-GG,,0,1,,In Stock,26,26,,,No,,30114,,,,86,No,100,**Item Ships in 2 Boxes**
2-JJ-C14703-TL-GG,2-JJ-C14703-TL-GG,,0,1,,In Stock,65,65,,,No,,30114,,,,86,No,100,**Item Ships in 2 Boxes**
2-JJ-C14703-WH-GG,2-JJ-C14703-WH-GG,,0,1,,In Stock,74,74,,,No,,30114,,,,86,No,100,**Item Ships in 2 Boxes**
2-TLH-037-BGE-GG,2-TLH-037-BGE-GG,,1,1,,Back Ordered,0,0,,,No,,30114,,,,21,Yes,250,**1 Per Box**
2-TLH-037-BK-GG,2-TLH-037-BK-GG,,0,1,,In Stock,826,826,,21.75''W x 23.50''D x 28.50''H,No,,30114,,,,21,Yes,250,**1 Per Box**
2-TLH-037-DK-BN-GG,2-TLH-037-DK-BN-GG,,0,1,,In Stock,977,977,,21.75''W x 23.50''D x 28.50''H,No,,30114,,,,21,Yes,250,**1 Per Box**
2-TLH-037-GY-GG,2-TLH-037-GY-GG,2021-04-23,1,1,2021-04-23,Back Ordered,0,0,,21.75''W x 23.50''D x 28.50''H,No,,30114,,,,21,Yes,250,**1 Per Box**
2-TLH-SC-044-B-GG,2-TLH-SC-044-B-GG,2021-06-04,1,1,2021-06-04,Back Ordered,0,0,,,No,,30114,,,,27,No,175,**1 Per Box**
2-XU-DG-60725-GG,2-XU-DG-60725-GG,,0,1,,In Stock,1,1,,,No,,30114,,,,15,No,175,**1 Per Box**
2-XU-DG-W0236-GG,2-XU-DG-W0236-GG,2021-05-13,1,1,2021-05-13,Back Ordered,0,0,,,No,,30114,,,,47,Yes,175,**1 Per Box**
2-XU-DG-W0236B-GG,2-XU-DG-W0236B-GG,2021-05-13,1,1,2021-05-13,Back Ordered,0,0,,,No,,30114,,,,52,Yes,175,**1 Per Box**
2-XU-DG-W0247B-GG,2-XU-DG-W0247B-GG,,0,1,,In Stock,28,28,,,No,,30114,,,,40,Yes,250,**1 Per Box**
2-YU-YCX-001-BLUE-GG,2-YU-YCX-001-BLUE-GG,,0,1,,In Stock,1408,1408,,,No,,30114,,,,12,No,175,**1 Per Box**
2-YU-YCX-001-GREEN-GG,2-YU-YCX-001-GREEN-GG,,0,1,,In Stock,978,978,,,No,,30114,,,,12,No,175,**1 Per Box**
2-YU-YCX-001-NAT-GG,2-YU-YCX-001-NAT-GG,,1,1,,Back Ordered,0,0,,,No,,30114,,,,12,No,175,**1 Per Box**
2-YU-YCX-001-RED-GG,2-YU-YCX-001-RED-GG,,0,1,,In Stock,1012,1012,,,No,,30114,,,,12,No,175,**1 Per Box**
2-YU-YCX-003-BLUE-GG,2-YU-YCX-003-BLUE-GG,,0,1,,In Stock,10088,10088,,12.50''W x 14''D x 20''H,No,,30114,,,,10,No,175,**1 Per Box**
2-YU-YCX-003-GREEN-GG,2-YU-YCX-003-GREEN-GG,,0,1,,In Stock,8673,8673,,12.50''W x 14''D x 20''H,No,,30114,,,,10,No,175,**1 Per Box**
2-YU-YCX-003-NAT-GG,2-YU-YCX-003-NAT-GG,,0,1,,In Stock,508,508,,,No,,30114,,,,10,No,175,**1 Per Box**
2-YU-YCX-003-RED-GG,2-YU-YCX-003-RED-GG,,0,1,,In Stock,7955,7955,,12.50''W x 14''D x 20''H,No,,30114,,,,10,No,175,**1 Per Box**
2-YU-YCX-004-BLUE-GG,2-YU-YCX-004-BLUE-GG,,0,1,,In Stock,1195,1195,,,No,,30114,,,,13,No,175,**1 Per Box**
2-YU-YCX-004-GREEN-GG,2-YU-YCX-004-GREEN-GG,,0,1,,In Stock,958,958,,,No,,30114,,,,13,No,175,**1 Per Box**
2-YU-YCX-004-NAT-GG,2-YU-YCX-004-NAT-GG,,0,1,,In Stock,518,518,,,No,,30114,,,,13,No,175,**1 Per Box**
2-YU-YCX-004-RED-GG,2-YU-YCX-004-RED-GG,,0,1,,In Stock,145,145,,,No,,30114,,,,13,No,175,**1 Per Box**
2-YU-YCX-005-BLUE-GG,2-YU-YCX-005-BLUE-GG,,0,1,,In Stock,788,788,,,No,,30114,,,,19,No,125,**1 Per Box**
2-YU-YCX-005-GREEN-GG,2-YU-YCX-005-GREEN-GG,,0,1,,In Stock,289,289,,,No,,30114,,,,19,No,125,**1 Per Box**
2-YU-YCX-005-RED-GG,2-YU-YCX-005-RED-GG,,0,1,,In Stock,470,470,,,No,,30114,,,,19,No,125,**1 Per Box**
2-YU-YCX-011-BLUE-GG,2-YU-YCX-011-BLUE-GG,,0,1,,In Stock,1497,1497,,,No,,30114,,,,10,No,175,**1 Per Box**
2-YU-YCX-011-GREEN-GG,2-YU-YCX-011-GREEN-GG,,0,1,,In Stock,815,815,,,No,,30114,,,,10,No,175,**1 Per Box**
2-YU-YCX-011-RED-GG,2-YU-YCX-011-RED-GG,,0,1,,In Stock,796,796,,,No,,30114,,,,10,No,175,**1 Per Box**
222-1-BK-GG,222-1-BK-GG,,0,1,,In Stock,36,36,,31.25''W x 30''D x 31.25''H,No,,38654 89506,,,,60,Yes,300,**1 Per Box**
222-1-BN-GG,222-1-BN-GG,,0,1,,In Stock,1,1,,31.25''W x 30''D x 31.25''H,No,,38654 89506,,,,60,Yes,300,**1 Per Box**
222-2-BK-GG,222-2-BK-GG,,0,1,,In Stock,49,49,,51''W x 30''D x 31.25''H,No,,38654 89506,,,,82,Yes,300,**1 Per Box**
222-2-BN-GG,222-2-BN-GG,2021-04-18,1,1,2021-04-18,Back Ordered,0,0,,51''W x 30''D x 31.25''H,No,,38654 89506,,,,82,Yes,300,**1 Per Box**
222-3-BK-GG,222-3-BK-GG,,0,1,,In Stock,31,31,,68.50''W x 30''D x 31.25''H,No,,38654 89506,,,,102,Yes,300,**1 Per Box**
222-3-BN-GG,222-3-BN-GG,2021-05-17,1,1,2021-05-17,Back Ordered,0,0,,68.50''W x 30''D x 31.25''H,No,,38654 89506 30114,,,,102,Yes,300,**1 Per Box**
222-SET-BK-GG,222-SET-BK-GG,,1,1,,Back Ordered,0,0,,31.25'' - 68.50''W x 30''D x 31.25''H,No,,89506 38654,,,,244,Yes,300,**Item Ships in 3 Boxes**
222-SET-BN-GG,222-SET-BN-GG,,1,1,,Back Ordered,0,0,,31.25'' - 68.50''W x 30''D x 31.25''H,No,,89506 38654,,,,244,Yes,300,**Item Ships in 3 Boxes**
4-ET-31320-24-BK-R-GG,4-ET-31320-24-BK-R-GG,,0,1,,In Stock,81,81,,,No,,30114,,,,11,Yes,175,**1 Per Box**
4-ET-31320-24-GN-R-GG,4-ET-31320-24-GN-R-GG,,0,1,,In Stock,220,220,,,No,,30114,,,,11,Yes,175,**1 Per Box**
4-ET-31320-24-SV-R-GG,4-ET-31320-24-SV-R-GG,,0,1,,In Stock,168,168,,,No,,30114,,,,11,Yes,175,**1 Per Box**
4-ET-31320-24-TL-R-GG,4-ET-31320-24-TL-R-GG,,0,1,,In Stock,140,140,,,No,,30114,,,,11,Yes,175,**1 Per Box**
4-ET-31320-30-BK-R-GG,4-ET-31320-30-BK-R-GG,,0,1,,In Stock,621,621,,,No,,30114,,,,11.5,Yes,175,**1 Per Box**
4-ET-31320-30-GN-R-GG,4-ET-31320-30-GN-R-GG,,0,1,,In Stock,245,245,,,No,,30114,,,,11.5,Yes,175,**1 Per Box**
4-ET-31320-30-SV-R-GG,4-ET-31320-30-SV-R-GG,,0,1,,In Stock,446,446,,,No,,30114,,,,11.5,Yes,175,**1 Per Box**
4-ET-31320-30-TL-R-GG,4-ET-31320-30-TL-R-GG,,0,1,,In Stock,229,229,,,No,,30114,,,,11.5,Yes,175,**1 Per Box**
4-ET-31320W-24-BK-R-GG,4-ET-31320W-24-BK-R-GG,,1,1,,Back Ordered,0,0,,,No,,30114,,,,48,No,175,**1 Per Box**
4-ET-31320W-24-GN-R-GG,4-ET-31320W-24-GN-R-GG,,1,1,,Back Ordered,0,0,,,No,,30114,,,,48,No,175,**1 Per Box**
4-ET-31320W-24-SV-R-GG,4-ET-31320W-24-SV-R-GG,,1,1,,Back Ordered,0,0,,,No,,30114,,,,48,No,175,**1 Per Box**
4-ET-31320W-24-TL-R-GG,4-ET-31320W-24-TL-R-GG,,1,1,,Back Ordered,0,0,,,No,,30114,,,,48,No,175,**1 Per Box**
4-ET-31320W-30-BK-R-GG,4-ET-31320W-30-BK-R-GG,,1,1,,Back Ordered,0,0,,,No,,30114,,,,55,No,175,**1 Per Box**
4-ET-31320W-30-GN-R-GG,4-ET-31320W-30-GN-R-GG,,1,1,,Back Ordered,0,0,,,No,,30114,,,,55,No,175,**1 Per Box**
4-ET-31320W-30-SV-R-GG,4-ET-31320W-30-SV-R-GG,,1,1,,Back Ordered,0,0,,,No,,30114,,,,55,No,175,**1 Per Box**
4-ET-31320W-30-TL-R-GG,4-ET-31320W-30-TL-R-GG,,1,1,,Back Ordered,0,0,,,No,,30114,,,,55,No,175,**1 Per Box**
4-JJ-303C-B-GG,4-JJ-303C-B-GG,2021-04-29,1,1,2021-04-29,Back Ordered,0,0,,,No,,30114,,,,50,Yes,175,**1 Per Box**
4-JJ-303C-G-GG,4-JJ-303C-G-GG,,0,1,,In Stock,719,719,,,No,,30114,,,,50,Yes,175,**1 Per Box**
4-JJ-303C-GG,4-JJ-303C-GG,,0,1,,In Stock,233,233,,,No,,30114,,,,50,Yes,175,**1 Per Box**
4-WFC-SLAT-AB-GG,4-WFC-SLAT-AB-GG,,0,1,,In Stock,236,236,,,No,,30114,,,,48,Yes,85,**1 Per Box**
4-YU-YCX4-001-BLUE-GG,4-YU-YCX4-001-BLUE-GG,,0,1,,In Stock,704,704,,,No,,30114,,,,19.1,Yes,175,**1 Per Box**
4-YU-YCX4-001-GREEN-GG,4-YU-YCX4-001-GREEN-GG,,0,1,,In Stock,489,489,,,No,,30114,,,,19.1,Yes,175,**1 Per Box**
4-YU-YCX4-001-NAT-GG,4-YU-YCX4-001-NAT-GG,,1,1,,Back Ordered,0,0,,,No,,30114,,,,19.1,Yes,175,**1 Per Box**
4-YU-YCX4-001-RED-GG,4-YU-YCX4-001-RED-GG,,0,1,,In Stock,506,506,,,No,,30114,,,,19.1,Yes,175,**1 Per Box**
4-YU-YCX4-003-BLUE-GG,4-YU-YCX4-003-BLUE-GG,,0,1,,In Stock,5042,5042,,,No,,30114,,,,13,Yes,175,**1 Per Box**
4-YU-YCX4-003-GREEN-GG,4-YU-YCX4-003-GREEN-GG,,0,1,,In Stock,4337,4337,,,No,,30114,,,,13,Yes,175,**1 Per Box**
4-YU-YCX4-003-MULTI-GG,4-YU-YCX4-003-MULTI-GG,,0,1,,In Stock,1024,1024,,,No,,30114,,,,13,Yes,175,**1 Per Box**
4-YU-YCX4-003-NAT-GG,4-YU-YCX4-003-NAT-GG,,0,1,,In Stock,255,255,,,No,,30114,,,,13,Yes,175,**1 Per Box**
4-YU-YCX4-003-RED-GG,4-YU-YCX4-003-RED-GG,,0,1,,In Stock,3976,3976,,,No,,30114,,,,21,Yes,175,**1 Per Box**
4-YU-YCX4-004-BLUE-GG,4-YU-YCX4-004-BLUE-GG,,0,1,,In Stock,597,597,,,No,,30114,,,,21,Yes,175,**1 Per Box**
4-YU-YCX4-004-GREEN-GG,4-YU-YCX4-004-GREEN-GG,,0,1,,In Stock,479,479,,,No,,30114,,,,21,Yes,175,**1 Per Box**
4-YU-YCX4-004-MULTI-GG,4-YU-YCX4-004-MULTI-GG,,0,1,,In Stock,38,38,,,No,,30114,,,,21,Yes,175,**1 Per Box**
4-YU-YCX4-004-NAT-GG,4-YU-YCX4-004-NAT-GG,,0,1,,In Stock,259,259,,,No,,30114,,,,21,Yes,175,**1 Per Box**
4-YU-YCX4-004-RED-GG,4-YU-YCX4-004-RED-GG,,0,1,,In Stock,72,72,,,No,,30114,,,,21,Yes,175,**1 Per Box**
4-YU-YCX4-005-BLUE-GG,4-YU-YCX4-005-BLUE-GG,,0,1,,In Stock,393,393,,,No,,30114,,,,37,Yes,125,**1 Per Box**
4-YU-YCX4-005-GREEN-GG,4-YU-YCX4-005-GREEN-GG,,0,1,,In Stock,144,144,,,No,,30114,,,,37,Yes,125,**1 Per Box**
4-YU-YCX4-005-RED-GG,4-YU-YCX4-005-RED-GG,,0,1,,In Stock,235,235,,,No,,30114,,,,37,Yes,125,**1 Per Box**
4-YU-YCX4-011-BLUE-GG,4-YU-YCX4-011-BLUE-GG,,0,1,,In Stock,748,748,,,No,,30114,,,,16,Yes,125,**1 Per Box**
4-YU-YCX4-011-GREEN-GG,4-YU-YCX4-011-GREEN-GG,,0,1,,In Stock,407,407,,,No,,30114,,,,16,Yes,125,**1 Per Box**
4-YU-YCX4-011-RED-GG,4-YU-YCX4-011-RED-GG,,0,1,,In Stock,397,397,,,No,,30114,,,,16,Yes,125,**1 Per Box**
801L-LF0005-BK-LEA-GG,801L-LF0005-BK-LEA-GG,,0,1,,In Stock,154,154,,33''W x 33''D x 43.50'' - 47''H,No,,30114 89506,,,,57,No,175,**1 Per Box**
801L-LF0019-BY-LEA-GG,801L-LF0019-BY-LEA-GG,,0,1,,In Stock,203,203,,33''W x 33''D x 43.50'' - 47''H,No,,30114 89506,,,,57,No,175,**1 Per Box**
802-BRN-GG,802-BRN-GG,,0,1,,In Stock,233,233,,26''W x 21.25''D x 43.75'' - 47.25''H,No,,30114 89506,,,,57,No,175,**1 Per Box**
827FABRIC-BCG-SB,827FABRIC-BCG-SB,,0,1,,In Stock,8,8,,,No,,30114,,,,18,Yes,125,**4 Per Box**
ADV-SSC-12BLK,ADV-SSC-12BLK,,0,1,,In Stock,2683,2683,,,No,,30114,,,,5.82,Yes,175,**5 Per Box**
ADV-SSC-12NAVY,ADV-SSC-12NAVY,,0,1,,In Stock,201,201,,,No,,30114,,,,5.82,Yes,175,**5 Per Box**
ADV-SSC-14BLK,ADV-SSC-14BLK,,0,1,,In Stock,2842,2842,,,No,,30114,,,,6,Yes,125,**5 Per Box**
ADV-SSC-14NAVY,ADV-SSC-14NAVY,,0,1,,In Stock,265,265,,,No,,30114,,,,6,Yes,125,**5 Per Box**
ADV-SSC-16BLK,ADV-SSC-16BLK,,0,1,,In Stock,2955,2955,,,No,,30114,,,,9,Yes,125,**4 Per Box**
ADV-SSC-16NAVY,ADV-SSC-16NAVY,,0,1,,In Stock,359,359,,,No,,30114,,,,9,Yes,125,**4 Per Box**
ADV-SSC-18BLK,ADV-SSC-18BLK,,0,1,,In Stock,2347,2347,,,No,,30114,,,,9.44,Yes,175,**4 Per Box**
ADV-SSC-18NAVY,ADV-SSC-18NAVY,,0,1,,In Stock,991,991,,,No,,30114,,,,9.44,Yes,175,**4 Per Box**
ADV-TITAN-18BLK,ADV-TITAN-18BLK,,0,1,,In Stock,1665,1665,,,No,,30114,,,,12,Yes,175,**3 Per Box**
ADV-TITAN-18NAVY,ADV-TITAN-18NAVY,,0,1,,In Stock- Planned to Discontinue,574,574,,,No,,30114,,,,12,Yes,175,**3 Per Box**
ADV-TITAN-TASKBLK,ADV-TITAN-TASKBLK,,0,1,,In Stock,5,5,,,No,,30114,,,,20,Yes,125,**1 Per Box**
AM-H9460-5860-GG,AM-H9460-5860-GG,,1,1,,Out of Stock,0,0,,41.50''W x 43'' - 67''D x 43.50''H,No,,38654,,,,120,Yes,300,**Item Ships in 2 Boxes**
AM-H9460-5861-GG,AM-H9460-5861-GG,,1,1,,Back Ordered,0,0,,41.50''W x 43'' - 67''D x 43.50''H,No,,38654,,,,120,Yes,300,**Item Ships in 2 Boxes**
AM-H9460-5983-GG,AM-H9460-5983-GG,,1,1,,Back Ordered,0,0,,41.50''W x 43'' - 67''D x 43.50''H,No,,38654,,,,120,Yes,300,**Item Ships in 2 Boxes**
AM-H9560-6450-GG,AM-H9560-6450-GG,,1,1,,Back Ordered,0,0,,39''W x 43'' - 73''D x 46''H,No,,38654,,,,120,Yes,300,**Item Ships in 2 Boxes**
AW-MC309AF-BG-GG,AW-MC309AF-BG-GG,,0,1,,In Stock,574,574,,18.75''W x 18''D x 30''H,No,,30114,,,,11,Yes,85,**4 Per Box**
AW-MC309AF-BLK-GG,AW-MC309AF-BLK-GG,,0,1,,In Stock,1220,1220,,18.75''W x 18''D x 30''H,No,,89506 30114,,,,11,Yes,85,**4 Per Box**
AW-MC309AF-BRN-GG,AW-MC309AF-BRN-GG,,0,1,,In Stock,1197,1197,,18.75''W x 18''D x 30''H,No,,30114 89506,,,,11,Yes,85,**4 Per Box**
AW-MC320AF-BG-EMB-GG,AW-MC320AF-BG-EMB-GG,,0,1,,In Stock,3309,3309,,18''W x 20''D x 29.50''H,No,,30114,,,,11.6,Yes,85,**4 Per Box**
AW-MC320AF-BG-GG,AW-MC320AF-BG-GG,,0,1,,In Stock,3326,3326,,18''W x 20''D x 29.50''H,No,,30114,,,,11.6,Yes,85,**4 Per Box**
AW-MC320AF-BK-EMB-GG,AW-MC320AF-BK-EMB-GG,,0,1,,In Stock,230,230,,18''W x 20''D x 29.50''H,No,,30114,,,,11.6,Yes,85,**4 Per Box**
AW-MC320AF-BK-GG,AW-MC320AF-BK-GG,,0,1,,In Stock,230,230,,18''W x 20''D x 29.50''H,No,,30114,,,,11.6,Yes,85,**4 Per Box**
AW-MC320AF-GRY-EMB-GG,AW-MC320AF-GRY-EMB-GG,,0,1,,In Stock,397,397,,18''W x 20''D x 29.50''H,No,,30114,,,,11.6,Yes,85,**4 Per Box**
AW-MC320AF-GRY-GG,AW-MC320AF-GRY-GG,,0,1,,In Stock,396,396,,18''W x 20''D x 29.50''H,No,,30114,,,,11.6,Yes,85,**4 Per Box**
AW-MC320AF-NVY-EMB-GG,AW-MC320AF-NVY-EMB-GG,,0,1,,In Stock,617,617,,18''W x 20''D x 29.50''H,No,,30114,,,,11.6,Yes,85,**2 Per Box**
AW-MC320AF-NVY-GG,AW-MC320AF-NVY-GG,,0,1,,In Stock,617,617,,18''W x 20''D x 29.50''H,No,,30114,,,,11.6,Yes,85,**4 Per Box**
B-Z100-BLACK-GG,B-Z100-BLACK-GG,,0,1,,In Stock,89,89,,24''W x 27''D x 31.50''H,No,,89506 30114,,,,27.62,No,175,**1 Per Box**
B-Z100-BRN-GG,B-Z100-BRN-GG,,0,1,,In Stock,31,31,,24''W x 27''D x 31.50''H,No,,30114 89506,,,,27.62,No,175,**1 Per Box**
B-Z100-GY-GG,B-Z100-GY-GG,,0,1,,In Stock,21,21,,24''W x 27''D x 31.50''H,No,,30114,,,,27.62,No,175,**1 Per Box**
B-Z100-LF-0005-BK-LEA-GG,B-Z100-LF-0005-BK-LEA-GG,,0,1,,In Stock,698,698,,24''W x 27''D x 31.50''H,No,,89506,,,,27.62,No,175,**1 Per Box**
B-Z100-LF19-LEA-GG,B-Z100-LF19-LEA-GG,,0,1,,In Stock,13,13,,24''W x 27''D x 31.50''H,No,,30114 89506,,,,27.62,No,175,**1 Per Box**
B-Z100-NAVY-GG,B-Z100-NAVY-GG,,0,1,,In Stock,72,72,,24''W x 27''D x 31.50''H,No,,30114 89506,,,,27.62,No,175,**1 Per Box**
B-Z100-OXBLOOD-GG,B-Z100-OXBLOOD-GG,,0,1,,In Stock,162,162,,24''W x 27''D x 31.50''H,No,,30114,,,,27.62,No,175,**1 Per Box**
B-Z105-BLACK-GG,B-Z105-BLACK-GG,,0,1,,In Stock,108,108,,24''W x 27''D x 31.50''H,No,,30114 89506,,,,27.62,No,175,**1 Per Box**
B-Z105-BRN-GG,B-Z105-BRN-GG,,0,1,,In Stock,98,98,,24''W x 27''D x 31.50''H,No,,30114 89506,,,,27.62,No,175,**1 Per Box**
B-Z105-GY-GG,B-Z105-GY-GG,,0,1,,In Stock,34,34,,24''W x 27''D x 31.50''H,No,,30114,,,,27.62,No,175,**1 Per Box**
B-Z105-LF-0005-BK-LEA-GG,B-Z105-LF-0005-BK-LEA-GG,2021-06-06,1,1,2021-06-06,Back Ordered,0,0,,24''W x 27''D x 31.50''H,No,,30114 89506,,,,27.62,No,175,**1 Per Box**
B-Z105-LF19-LEA-GG,B-Z105-LF19-LEA-GG,,0,1,,In Stock,87,87,,24''W x 27''D x 31.50''H,No,,89506,,,,27.62,No,175,**1 Per Box**
B-Z105-NAVY-GG,B-Z105-NAVY-GG,,0,1,,In Stock,46,46,,24''W x 27''D x 31.50''H,No,,30114 89506,,,,27.62,No,175,**1 Per Box**
B-Z105-OXBLOOD-GG,B-Z105-OXBLOOD-GG,,0,1,,In Stock,71,71,,24''W x 27''D x 31.50''H,No,,30114 89506,,,,27.62,No,175,**1 Per Box**
BD-F002-BGE-GG,BD-F002-BGE-GG,,0,1,,In Stock,6354,6354,,18''W x 18''D x 30.5''H,No,,30114,,,,8,Yes,85,**4 Per Box**
BD-F002-BK-GG,BD-F002-BK-GG,,0,1,,In Stock,7604,7604,,18''W x 18''D x 30.5''H,No,,30114,,,,8,Yes,85,**4 Per Box**
BD-F002-GY-GG,BD-F002-GY-GG,,0,1,,In Stock,16852,16852,,18''W x 18''D x 30.5''H,No,,30114,,,,8,Yes,85,**4 Per Box**
BD-F002-RED-GG,BD-F002-RED-GG,,0,1,,In Stock,3367,3367,,18''W x 18''D x 30.5''H,No,,30114,,,,8,Yes,85,**4 Per Box**
BH-BK-HARD-VYL-GG,BH-BK-HARD-VYL-GG,,0,1,,In Stock,748,748,,15.50''W x 15.50''D x 2''H,No,,38654 89506,,,,3,Yes,200,**20 Per Box**
BH-BLACK-HARD-GG,BH-BLACK-HARD-GG,,0,1,,In Stock,2143,2143,,15''W x 15''D x 1.75''H,No,,89506 30114,,,,3,Yes,200,**20 Per Box**
BH-BRN-GG,BH-BRN-GG,,0,1,,In Stock,641,641,,16''W x 15.50''D x 1.75''H,No,,89506 38654,,,,2,Yes,250,**22 Per Box**
BH-BURG-GG,BH-BURG-GG,,0,1,,In Stock,673,673,,16''W x 15.50''D x 1.75''H,No,,89506 38654,,,,2,Yes,250,**22 Per Box**
BH-GOLD-HARD-VYL-GG,BH-GOLD-HARD-VYL-GG,2021-04-17,1,1,2021-04-17,Back Ordered,0,0,,15.50''W x 15.50''D x 2''H,No,,38654 89506,,,,3,Yes,200,**20 Per Box**
BH-H002-CRYSTAL-GG,BH-H002-CRYSTAL-GG,2021-06-08,1,1,2021-06-08,Back Ordered,0,0,,15.50''W x 18.25''D x 35''H,No,,30114,,,,9,Yes,175,**2 Per Box**
BH-H007-CRYSTAL-GG,BH-H007-CRYSTAL-GG,,0,1,,In Stock,527,527,,16''W x 19.25''D x 36''H,No,,30114,,,,9,Yes,175,**2 Per Box**
BH-ICE-CRYSTAL-GG,BH-ICE-CRYSTAL-GG,2021-05-24,1,1,2021-05-24,Back Ordered,0,0,,15.75''W x 20''D x 36.25''H,No,,30114,,,,12,Yes,250,**2 Per Box**
BH-IVORY-GG,BH-IVORY-GG,,0,1,,In Stock,471,471,,16''W x 15.50''D x 1.75''H,No,,38654 89506,,,,2,Yes,250,**22 Per Box**
BH-IVORY-HARD-GG,BH-IVORY-HARD-GG,,0,1,,In Stock,2612,2612,,15''W x 15''D x 1.75''H,No,,30114,,,,3,Yes,200,**20 Per Box**
BH-IVORY-HARD-VYL-GG,BH-IVORY-HARD-VYL-GG,,0,1,,In Stock,1,1,,15.50''W x 15.50''D x 2''H,No,,89506 38654,,,,3,Yes,200,**20 Per Box**
BH-K002-CRYSTAL-GG,BH-K002-CRYSTAL-GG,,0,1,,In Stock,35,35,,18''W x 21.25''D x 38''H,No,,30114,,,,9,Yes,175,**2 Per Box**
BH-SIL-HARD-VYL-GG,BH-SIL-HARD-VYL-GG,,0,1,,In Stock,1589,1589,,15.50''W x 15.50''D x 2''H,No,,89506 38654,,,,3,Yes,200,**20 Per Box**
BH-WH-HARD-GG,BH-WH-HARD-GG,,0,1,,In Stock,728,728,,15.50''W x 15.50''D x 2''H,No,,89506 38654,,,,3,Yes,200,**20 Per Box**
BH-WH-HARD-VYL-GG,BH-WH-HARD-VYL-GG,2021-04-17,1,1,2021-04-17,Back Ordered,0,0,,15.50''W x 15.50''D x 2''H,No,,38654 89506,,,,3,Yes,200,**20 Per Box**
BL-8801X-GG,BL-8801X-GG,,0,1,,In Stock,371,371,,13'' - 24.5''W x 22''D x 39'' - 41''H,No,,30114,,,,42,No,175,**1 Per Box**
BL-LB-8801X-D-BLK-GG,BL-LB-8801X-D-BLK-GG,,0,1,,In Stock,6,6,,,No,,30114,,,,48,No,100,**1 Per Box**
BL-LB-8801X-D-GG,BL-LB-8801X-D-GG,,0,1,,In Stock,1671,1671,,13'' - 26''W x 22''D x 43'' - 50.25''H,No,,30114,,,,47,No,125,**1 Per Box**
BL-LB-8803-GG,BL-LB-8803-GG,,0,1,,In Stock,23,23,,,No,,30114,,,,47,No,125,**1 Per Box**
BL-LB-8809-LEA-GG,BL-LB-8809-LEA-GG,2021-04-18,1,1,2021-04-18,Back Ordered,0,0,,,No,,30114,,,,47,No,125,**1 Per Box**
BL-LB-8816D-GG,BL-LB-8816D-GG,2021-04-19,1,1,2021-04-19,Back Ordered,0,0,,,No,,30114,,,,47,Yes,125,**1 Per Box**
BL-LB-8817-GG,BL-LB-8817-GG,2021-05-23,1,1,2021-05-23,Back Ordered,0,0,,,No,,30114,,,,47,No,125,**1 Per Box**
BL-X-5C-BK-LEA-GG,BL-X-5C-BK-LEA-GG,,0,1,,In Stock,149,149,,,No,,30114,,,,31.5,No,175,**1 Per Box**
BL-X-5C-GG,BL-X-5C-GG,,0,1,,In Stock,120,120,,,No,,30114,,,,31.5,No,175,**1 Per Box**
BL-X-5H-GG,BL-X-5H-GG,,0,1,,In Stock,84,84,,25.50''W x 24''D x 47.50'' - 52.50''H,No,,30114,,,,36.22,No,100,**1 Per Box**
BL-X-5M-BK-GG,BL-X-5M-BK-GG,,0,1,,In Stock,16973,16973,,24.50''W x 25.50''D x 37.50'' - 41.25''H,No,,30114 89506,,,,33,No,125,**1 Per Box**
BL-X-5M-BLUE-GG,BL-X-5M-BLUE-GG,,0,1,,In Stock,187,187,,,No,,30114,,,,33,No,125,**1 Per Box**
BL-X-5M-D-BK-LEA-GG,BL-X-5M-D-BK-LEA-GG,,0,1,,In Stock,15,15,,,No,,30114,,,,12,No,125,**1 Per Box**
BL-X-5M-D-BLUE-GG,BL-X-5M-D-BLUE-GG,2021-05-11,1,1,2021-05-11,Back Ordered,0,0,,,No,,30114,,,,12,No,125,**1 Per Box**
BL-X-5M-D-DKGY-GG,BL-X-5M-D-DKGY-GG,2021-06-02,1,1,2021-06-02,Back Ordered,0,0,,,No,,30114,,,,12,No,125,**1 Per Box**
BL-X-5M-D-GG,BL-X-5M-D-GG,,0,1,,In Stock,4186,4186,,24.50''W x 25.50''D x 43.25'' - 50.75''H,No,,30114,,,,38,No,125,**1 Per Box**
BL-X-5M-D-RED-GG,BL-X-5M-D-RED-GG,,0,1,,In Stock,281,281,,,No,,30114,,,,12,No,125,**1 Per Box**
BL-X-5M-D-WH-GG,BL-X-5M-D-WH-GG,,0,1,,In Stock,188,188,,,No,,30114,,,,12,No,125,**1 Per Box**
BL-X-5M-DKGY-GG,BL-X-5M-DKGY-GG,,0,1,,In Stock,1,1,,,No,,30114,,,,33,No,125,**1 Per Box**