"id","code","next-available","out-of-stock","orderable","Est Arrival Date","Status","Available Quantity","available-qty","free-ship-method","dimensions","ship-alone","flat-ship-rates","origin-zip","number-of-boxes","invalid-ship-methods","upsable","ship-weight","global-free-ship-exclusion","freight-class","outbound-shipping"
111-1-BK-GG,111-1-BK-GG,,0,1,,In Stock,127,127,,33.50''W x 31''D x 29''H,No,,38654 89506,,,,54,Yes,300,**1 Per Box**
111-1-BN-GG,111-1-BN-GG,,0,1,,In Stock,73,73,,33.50''W x 31''D x 29''H,No,,38654 89506,,,,54,Yes,300,**1 Per Box**
111-1-CG-GG,111-1-CG-GG,,0,1,,In Stock,49,49,,33.50''W x 31''D x 29''H,No,,30114,,,,54,Yes,300,**1 Per Box**
111-1-GY-GG,111-1-GY-GG,,0,1,,In Stock,33,33,,33.50''W x 31''D x 29''H,No,,30114,,,,54,Yes,300,**1 Per Box**
111-1-WH-GG,111-1-WH-GG,,0,1,,In Stock,75,75,,33.50''W x 31''D x 29''H,No,,38654 89506,,,,54,Yes,300,**1 Per Box**
111-2-BK-GG,111-2-BK-GG,,0,1,,In Stock,96,96,,52''W x 29''D x 29''H,No,,38654 89506,,,,74,Yes,300,**1 Per Box**
111-2-BN-GG,111-2-BN-GG,,0,1,,In Stock,11,11,,52''W x 29''D x 29''H,No,,38654 89506,,,,74,Yes,300,**1 Per Box**
111-2-CG-GG,111-2-CG-GG,,0,1,,In Stock,46,46,,52''W x 29''D x 29''H,No,,30114,,,,74,Yes,300,**1 Per Box**
111-2-GY-GG,111-2-GY-GG,,0,1,,In Stock,27,27,,52''W x 29''D x 29''H,No,,30114,,,,74,Yes,300,**1 Per Box**
111-2-WH-GG,111-2-WH-GG,,0,1,,In Stock,89,89,,52''W x 29''D x 29''H,No,,38654 89506,,,,74,Yes,300,**1 Per Box**
111-3-BK-GG,111-3-BK-GG,,0,1,,In Stock,66,66,,72.75''W x 29''D x 29''H,No,,38654 89506,,,,94,Yes,300,**1 Per Box**
111-3-BN-GG,111-3-BN-GG,,0,1,,In Stock,35,35,,72.75''W x 29''D x 29''H,No,,38654 89506,,,,94,Yes,300,**1 Per Box**
111-3-CG-GG,111-3-CG-GG,,0,1,,In Stock,36,36,,72.75''W x 29''D x 29''H,No,,30114,,,,94,Yes,300,**1 Per Box**
111-3-GY-GG,111-3-GY-GG,,0,1,,In Stock,35,35,,72.75''W x 29''D x 29''H,No,,30114,,,,94,Yes,300,**1 Per Box**
111-3-WH-GG,111-3-WH-GG,,0,1,,In Stock,26,26,,72.75''W x 29''D x 29''H,No,,38654 89506,,,,94,Yes,300,**1 Per Box**
111-SET-BK-GG,111-SET-BK-GG,,0,1,,In Stock,37,37,,33.50'' - 72.75''W x 29'' - 31''D x 29''H,No,,89506 38654,,,,222,Yes,300,**Item Ships in 3 Boxes**
111-SET-BN-GG,111-SET-BN-GG,,0,1,,In Stock,1,1,,33.50'' - 72.75''W x 29'' - 31''D x 29''H,No,,89506 38654,,,,222,Yes,300,**Item Ships in 3 Boxes**
111-SET-CG-GG,111-SET-CG-GG,,0,1,,In Stock,36,36,,33.50'' - 72.75''W x 29'' - 31''D x 29''H,No,,30114,,,,222,Yes,300,**Item Ships in 3 Boxes**
111-SET-GY-GG,111-SET-GY-GG,,0,1,,In Stock,27,27,,33.50'' - 72.75''W x 29'' - 31''D x 29''H,No,,30114,,,,222,Yes,300,**Item Ships in 3 Boxes**
111-SET-WH-GG,111-SET-WH-GG,,0,1,,In Stock,26,26,,33.50'' - 72.75''W x 29'' - 31''D x 29''H,No,,89506 38654,,,,222,Yes,300,**Item Ships in 3 Boxes**
2-ET-ER18345-24-DB-GG,2-ET-ER18345-24-DB-GG,,0,1,,In Stock,131,131,,,No,,30114,,,,21,Yes,125,**1 Per Box**
2-ET-ER18345-24-GY-GG,2-ET-ER18345-24-GY-GG,2020-09-14,1,1,2020-09-14,Back Ordered,0,0,,,No,,30114,,,,21,Yes,125,**1 Per Box**
2-ET-ER18345-24-LB-GG,2-ET-ER18345-24-LB-GG,2020-09-14,1,1,2020-09-14,Back Ordered,0,0,,,No,,30114,,,,21,Yes,125,**1 Per Box**
2-ET-ER18345-30-DB-GG,2-ET-ER18345-30-DB-GG,,0,1,,In Stock,231,231,,,No,,30114,,,,23,Yes,125,**1 Per Box**
2-ET-ER18345-30-GY-GG,2-ET-ER18345-30-GY-GG,,0,1,,In Stock,80,80,,,No,,30114,,,,23,Yes,125,**1 Per Box**
2-ET-ER18345-30-LB-GG,2-ET-ER18345-30-LB-GG,2020-09-14,1,1,2020-09-14,Back Ordered,0,0,,,No,,30114,,,,23,Yes,125,**1 Per Box**
2-ET-SWVLPTO-30-BK-GG,2-ET-SWVLPTO-30-BK-GG,,0,1,,In Stock,301,301,,,No,,30114,,,,60,Yes,85,
2-ET-SWVLPTO-30-GG,2-ET-SWVLPTO-30-GG,,0,1,,In Stock,296,296,,,No,,30114,,,,60,Yes,85,
2-XU-2424-MAR-GG,2-XU-2424-MAR-GG,,1,0,,Temporarily Out of Stock,0,0,,,No,,30114,,,,20,Yes,70,**1 Per Box**
2-XU-2430-MAR-GG,2-XU-2430-MAR-GG,,1,0,,Temporarily Out of Stock,0,0,,,No,,30114,,,,30,Yes,70,**1 Per Box**
2-XU-2430-WD-GG,2-XU-2430-WD-GG,,1,0,,Temporarily Out of Stock,0,0,,,No,,30114,,,,30,Yes,70,**1 Per Box**
2-XU-2442-MAR-GG,2-XU-2442-MAR-GG,,1,0,,Temporarily Out of Stock,0,0,,,No,,30114,,,,,Yes,,
2-XU-2442-WD-GG,2-XU-2442-WD-GG,,1,0,,Temporarily Out of Stock,0,0,,,No,,30114,,,,,Yes,70,
2-XU-3030-MAR-GG,2-XU-3030-MAR-GG,,1,0,,Temporarily Out of Stock,0,0,,,No,,30114,,,,,Yes,,
2-XU-3030-WD-GG,2-XU-3030-WD-GG,,1,0,,Temporarily Out of Stock,0,0,,,No,,30114,,,,,Yes,110,
2-XU-3042-MAR-GG,2-XU-3042-MAR-GG,,1,0,,Temporarily Out of Stock,0,0,,,No,,30114,,,,,Yes,,
2-XU-3042-WD-GG,2-XU-3042-WD-GG,,1,0,,Temporarily Out of Stock,0,0,,,No,,30114,,,,,Yes,70,
2-XU-3048-MAR-GG,2-XU-3048-MAR-GG,,1,0,,Temporarily Out of Stock,0,0,,,No,,30114,,,,,Yes,,
2-XU-3048-WD-GG,2-XU-3048-WD-GG,,1,0,,Temporarily Out of Stock,0,0,,,No,,30114,,,,,Yes,70,
2-XU-3060-MAR-GG,2-XU-3060-MAR-GG,,1,0,,Temporarily Out of Stock,0,0,,,No,,30114,,,,,Yes,70,
2-XU-3060-WD-GG,2-XU-3060-WD-GG,,1,0,,Temporarily Out of Stock,0,0,,,No,,30114,,,,,Yes,70,
2-XU-3636-MAR-GG,2-XU-3636-MAR-GG,,1,0,,Temporarily Out of Stock,0,0,,,No,,30114,,,,,Yes,,
2-XU-3636-WD-GG,2-XU-3636-WD-GG,,1,0,,Temporarily Out of Stock,0,0,,,No,,30114,,,,,Yes,110,
2-XU-4242-MAR-GG,2-XU-4242-MAR-GG,,1,0,,Temporarily Out of Stock,0,0,,,No,,30114,,,,,Yes,,
2-XU-4242-WD-GG,2-XU-4242-WD-GG,,1,0,,Temporarily Out of Stock,0,0,,,No,,30114,,,,,Yes,150,
2-XU-RD-24-MAR-GG,2-XU-RD-24-MAR-GG,,1,0,,Temporarily Out of Stock,0,0,,,No,,30114,,,,20,Yes,70,**1 Per Box**
2-XU-RD-24-WD-GG,2-XU-RD-24-WD-GG,,1,0,,Temporarily Out of Stock,0,0,,,No,,30114,,,,20,Yes,70,**1 Per Box**
2-XU-RD-30-MAR-GG,2-XU-RD-30-MAR-GG,,1,0,,Temporarily Out of Stock,0,0,,,No,,30114,,,,30,Yes,70,**1 Per Box**
2-XU-RD-30-WD-GG,2-XU-RD-30-WD-GG,,1,0,,Temporarily Out of Stock,0,0,,,No,,30114,,,,30,Yes,110,**1 Per Box**
2-XU-RD-36-MAR-GG,2-XU-RD-36-MAR-GG,,1,0,,Temporarily Out of Stock,0,0,,,No,,30114,,,,,Yes,,
2-XU-RD-36-WD-GG,2-XU-RD-36-WD-GG,,1,0,,Temporarily Out of Stock,0,0,,,No,,30114,,,,,Yes,110,
2-XU-RD-42-MAR-GG,2-XU-RD-42-MAR-GG,,1,0,,Temporarily Out of Stock,0,0,,,No,,30114,,,,,Yes,,
2-XU-RD-42-WD-GG,2-XU-RD-42-WD-GG,,1,0,,Temporarily Out of Stock,0,0,,,No,,30114,,,,,Yes,100,
222-1-BK-GG,222-1-BK-GG,,0,1,,In Stock,125,125,,31.25''W x 30''D x 31.25''H,No,,38654 89506,,,,60,Yes,300,**1 Per Box**
222-1-BN-GG,222-1-BN-GG,,0,1,,In Stock,98,98,,31.25''W x 30''D x 31.25''H,No,,38654 89506,,,,60,Yes,300,**1 Per Box**
222-2-BK-GG,222-2-BK-GG,,0,1,,In Stock,11,11,,51''W x 30''D x 31.25''H,No,,38654 89506,,,,82,Yes,300,**1 Per Box**
222-2-BN-GG,222-2-BN-GG,,0,1,,In Stock,44,44,,51''W x 30''D x 31.25''H,No,,38654 89506,,,,82,Yes,300,**1 Per Box**
222-3-BK-GG,222-3-BK-GG,,0,1,,In Stock,67,67,,68.50''W x 30''D x 31.25''H,No,,38654 89506,,,,102,Yes,300,**1 Per Box**
222-3-BN-GG,222-3-BN-GG,,0,1,,In Stock,74,74,,68.50''W x 30''D x 31.25''H,No,,38654 89506 30114,,,,102,Yes,300,**1 Per Box**
222-SET-BK-GG,222-SET-BK-GG,,0,1,,In Stock,10,10,,31.25'' - 68.50''W x 30''D x 31.25''H,No,,89506 38654,,,,244,Yes,300,**Item Ships in 3 Boxes**
222-SET-BN-GG,222-SET-BN-GG,,0,1,,In Stock,39,39,,31.25'' - 68.50''W x 30''D x 31.25''H,No,,89506 38654,,,,244,Yes,300,**Item Ships in 3 Boxes**
4-ET-31320-24-BK-R-GG,4-ET-31320-24-BK-R-GG,,0,1,,In Stock,200,200,,,No,,30114,,,,11,Yes,175,**1 Per Box**
4-ET-31320-24-GN-R-GG,4-ET-31320-24-GN-R-GG,,0,1,,In Stock,731,731,,,No,,30114,,,,11,Yes,175,**1 Per Box**
4-ET-31320-24-SV-R-GG,4-ET-31320-24-SV-R-GG,,0,1,,In Stock,830,830,,,No,,30114,,,,11,Yes,175,**1 Per Box**
4-ET-31320-24-TL-R-GG,4-ET-31320-24-TL-R-GG,,1,1,,Out of Stock,0,0,,,No,,30114,,,,11,Yes,175,**1 Per Box**
4-ET-31320-30-BK-R-GG,4-ET-31320-30-BK-R-GG,,0,1,,In Stock,2157,2157,,,No,,30114,,,,11.5,Yes,175,**1 Per Box**
4-ET-31320-30-GN-R-GG,4-ET-31320-30-GN-R-GG,,0,1,,In Stock,1918,1918,,,No,,30114,,,,11.5,Yes,175,**1 Per Box**
4-ET-31320-30-SV-R-GG,4-ET-31320-30-SV-R-GG,,0,1,,In Stock,1919,1919,,,No,,30114,,,,11.5,Yes,175,**1 Per Box**
4-ET-31320-30-TL-R-GG,4-ET-31320-30-TL-R-GG,,1,1,,Out of Stock,0,0,,,No,,30114,,,,11.5,Yes,175,**1 Per Box**
627FABRIC-BCG-SB,627FABRIC-BCG-SB,,0,1,,In Stock,26,26,,,No,,30114,,,,18,Yes,125,**4 Per Box**
801L-LF0005-BK-LEA-GG,801L-LF0005-BK-LEA-GG,,0,1,,In Stock,82,82,,33''W x 33''D x 43.50'' - 47''H,No,,30114 89506,,,,57,No,175,**1 Per Box**
801L-LF0019-BY-LEA-GG,801L-LF0019-BY-LEA-GG,,0,1,,In Stock,37,37,,33''W x 33''D x 43.50'' - 47''H,No,,30114 89506,,,,57,No,175,**1 Per Box**
802-BRN-GG,802-BRN-GG,,0,1,,In Stock,61,61,,26''W x 21.25''D x 43.75'' - 47.25''H,No,,30114 89506,,,,57,No,175,**1 Per Box**
827FABRIC-BCG-SB,827FABRIC-BCG-SB,,0,1,,In Stock,1474,1474,,,No,,30114,,,,18,Yes,125,**4 Per Box**
ADV-SSC-12BLK,ADV-SSC-12BLK,,0,1,,In Stock,438,438,,,No,,30114,,,,5.82,Yes,175,**5 Per Box**
ADV-SSC-12NAVY,ADV-SSC-12NAVY,,0,1,,In Stock,759,759,,,No,,30114,,,,5.82,Yes,175,**5 Per Box**
ADV-SSC-14BLK,ADV-SSC-14BLK,,0,1,,In Stock,44,44,,,No,,30114,,,,6,Yes,125,**5 Per Box**
ADV-SSC-14NAVY,ADV-SSC-14NAVY,,0,1,,In Stock,246,246,,,No,,30114,,,,6,Yes,125,**5 Per Box**
ADV-SSC-16BLK,ADV-SSC-16BLK,,0,1,,In Stock,31,31,,,No,,30114,,,,9,Yes,125,**4 Per Box**
ADV-SSC-16NAVY,ADV-SSC-16NAVY,,0,1,,In Stock,542,542,,,No,,30114,,,,9,Yes,125,**4 Per Box**
ADV-SSC-18BLK,ADV-SSC-18BLK,,0,1,,In Stock,49,49,,,No,,30114,,,,9.44,Yes,175,**4 Per Box**
ADV-SSC-18NAVY,ADV-SSC-18NAVY,,0,1,,In Stock,2,2,,,No,,30114,,,,9.44,Yes,175,**4 Per Box**
ADV-TITAN-18BLK,ADV-TITAN-18BLK,,0,1,,In Stock,1115,1115,,,No,,30114,,,,12,Yes,175,**3 Per Box**
ADV-TITAN-18NAVY,ADV-TITAN-18NAVY,,0,1,,In Stock,616,616,,,No,,30114,,,,12,Yes,175,**3 Per Box**
ADV-TITAN-TASKBLK,ADV-TITAN-TASKBLK,,0,1,,In Stock,10,10,,,No,,30114,,,,20,Yes,125,**1 Per Box**
ADV-TITAN-TASKNAVY,ADV-TITAN-TASKNAVY,,0,1,,In Stock,239,239,,,No,,30114,,,,20,Yes,125,**1 Per Box**
AM-9460-5861-GG,AM-9460-5861-GG,,1,1,,Back Ordered,0,0,,41.50''W x 43'' - 67''D x 43.50''H,No,,38654,,,,125,Yes,300,**Item Ships in 2 Boxes**
AM-H9460-5860-GG,AM-H9460-5860-GG,,1,1,,Back Ordered,0,0,,41.50''W x 43'' - 67''D x 43.50''H,No,,38654,,,,120,Yes,300,**Item Ships in 2 Boxes**
AM-H9460-5861-GG,AM-H9460-5861-GG,,1,1,,Back Ordered,0,0,,41.50''W x 43'' - 67''D x 43.50''H,No,,38654,,,,120,Yes,300,**Item Ships in 2 Boxes**
AM-H9460-5983-GG,AM-H9460-5983-GG,,1,1,,Back Ordered,0,0,,41.50''W x 43'' - 67''D x 43.50''H,No,,38654,,,,120,Yes,300,**Item Ships in 2 Boxes**
AM-H9560-6450-GG,AM-H9560-6450-GG,,1,1,,Back Ordered,0,0,,39''W x 43'' - 73''D x 46''H,No,,38654,,,,120,Yes,300,**Item Ships in 2 Boxes**
AW-MC309AF-BG-GG,AW-MC309AF-BG-GG,2020-07-30,1,1,2020-07-30,Back Ordered,0,0,,18.75''W x 18''D x 30''H,No,,30114,,,,11,Yes,85,**4 Per Box**
AW-MC309AF-BLK-GG,AW-MC309AF-BLK-GG,,0,1,,In Stock,3,3,,18.75''W x 18''D x 30''H,No,,89506 30114,,,,11,Yes,85,**4 Per Box**
AW-MC309AF-BRN-GG,AW-MC309AF-BRN-GG,,0,1,,In Stock,13,13,,18.75''W x 18''D x 30''H,No,,30114 89506,,,,11,Yes,85,**4 Per Box**
AW-MC320AF-BG-EMB-GG,AW-MC320AF-BG-EMB-GG,,1,1,,Out of Stock,0,0,,18''W x 20''D x 29.50''H,No,,30114,,,,11.6,Yes,85,**4 Per Box**
AW-MC320AF-BG-GG,AW-MC320AF-BG-GG,,0,1,,In Stock,1,1,,18''W x 20''D x 29.50''H,No,,30114,,,,11.6,Yes,85,**4 Per Box**
AW-MC320AF-BK-EMB-GG,AW-MC320AF-BK-EMB-GG,,1,1,,Out of Stock,0,0,,18''W x 20''D x 29.50''H,No,,30114,,,,11.6,Yes,85,**4 Per Box**
AW-MC320AF-BK-GG,AW-MC320AF-BK-GG,2020-07-18,1,1,2020-07-18,Back Ordered,0,0,,18''W x 20''D x 29.50''H,No,,30114,,,,11.6,Yes,85,**4 Per Box**
AW-MC320AF-GRY-EMB-GG,AW-MC320AF-GRY-EMB-GG,,1,1,,Out of Stock,0,0,,18''W x 20''D x 29.50''H,No,,30114,,,,11.6,Yes,85,**4 Per Box**
AW-MC320AF-GRY-GG,AW-MC320AF-GRY-GG,2020-07-18,1,1,2020-07-18,Back Ordered,0,0,,18''W x 20''D x 29.50''H,No,,30114,,,,11.6,Yes,85,**4 Per Box**
AW-MC320AF-NVY-EMB-GG,AW-MC320AF-NVY-EMB-GG,,1,1,,Out of Stock,0,0,,18''W x 20''D x 29.50''H,No,,30114,,,,11.6,Yes,85,**2 Per Box**
AW-MC320AF-NVY-GG,AW-MC320AF-NVY-GG,2020-07-18,1,1,2020-07-18,Back Ordered,0,0,,18''W x 20''D x 29.50''H,No,,30114,,,,11.6,Yes,85,**4 Per Box**
B-Z100-BLACK-GG,B-Z100-BLACK-GG,,0,1,,In Stock,114,114,,24''W x 27''D x 31.50''H,No,,89506 30114,,,,27.62,No,175,**1 Per Box**
B-Z100-BRN-GG,B-Z100-BRN-GG,,0,1,,In Stock,82,82,,24''W x 27''D x 31.50''H,No,,30114 89506,,,,27.62,No,175,**1 Per Box**
B-Z100-GY-GG,B-Z100-GY-GG,,0,1,,In Stock,111,111,,24''W x 27''D x 31.50''H,No,,30114,,,,27.62,No,175,**1 Per Box**
B-Z100-LF-0005-BK-LEA-GG,B-Z100-LF-0005-BK-LEA-GG,,0,1,,In Stock,260,260,,24''W x 27''D x 31.50''H,No,,89506,,,,27.62,No,175,**1 Per Box**
B-Z100-LF19-LEA-GG,B-Z100-LF19-LEA-GG,,0,1,,In Stock,199,199,,24''W x 27''D x 31.50''H,No,,30114 89506,,,,27.62,No,175,**1 Per Box**
B-Z100-NAVY-GG,B-Z100-NAVY-GG,,0,1,,In Stock,214,214,,24''W x 27''D x 31.50''H,No,,30114 89506,,,,27.62,No,175,**1 Per Box**
B-Z100-OXBLOOD-GG,B-Z100-OXBLOOD-GG,2020-08-14,1,1,2020-08-14,Back Ordered,0,0,,24''W x 27''D x 31.50''H,No,,30114,,,,27.62,No,175,**1 Per Box**
B-Z105-BLACK-GG,B-Z105-BLACK-GG,,0,1,,In Stock,132,132,,24''W x 27''D x 31.50''H,No,,30114 89506,,,,27.62,No,175,**1 Per Box**
B-Z105-BRN-GG,B-Z105-BRN-GG,,0,1,,In Stock,136,136,,24''W x 27''D x 31.50''H,No,,30114 89506,,,,27.62,No,175,**1 Per Box**
B-Z105-GY-GG,B-Z105-GY-GG,,0,1,,In Stock,69,69,,24''W x 27''D x 31.50''H,No,,30114,,,,27.62,No,175,**1 Per Box**
B-Z105-LF-0005-BK-LEA-GG,B-Z105-LF-0005-BK-LEA-GG,,0,1,,In Stock,337,337,,24''W x 27''D x 31.50''H,No,,30114 89506,,,,27.62,No,175,**1 Per Box**
B-Z105-LF19-LEA-GG,B-Z105-LF19-LEA-GG,,0,1,,In Stock,99,99,,24''W x 27''D x 31.50''H,No,,89506,,,,27.62,No,175,**1 Per Box**
B-Z105-NAVY-GG,B-Z105-NAVY-GG,,0,1,,In Stock,130,130,,24''W x 27''D x 31.50''H,No,,30114 89506,,,,27.62,No,175,**1 Per Box**
B-Z105-OXBLOOD-GG,B-Z105-OXBLOOD-GG,,0,1,,In Stock,116,116,,24''W x 27''D x 31.50''H,No,,30114 89506,,,,27.62,No,175,**1 Per Box**
BD-F002-BGE-GG,BD-F002-BGE-GG,,0,1,,In Stock,7743,7743,,18''W x 18''D x 30.5''H,No,,30114,,,,8,Yes,85,**4 Per Box**
BD-F002-BK-GG,BD-F002-BK-GG,,0,1,,In Stock,6116,6116,,18''W x 18''D x 30.5''H,No,,30114,,,,8,Yes,85,**4 Per Box**
BD-F002-GY-GG,BD-F002-GY-GG,,0,1,,In Stock,15493,15493,,18''W x 18''D x 30.5''H,No,,30114,,,,8,Yes,85,**4 Per Box**
BD-F002-RED-GG,BD-F002-RED-GG,,0,1,,In Stock,1454,1454,,18''W x 18''D x 30.5''H,No,,30114,,,,8,Yes,85,**4 Per Box**
BH-BK-HARD-VYL-GG,BH-BK-HARD-VYL-GG,,0,1,,In Stock,7,7,,15.50''W x 15.50''D x 2''H,No,,38654 89506,,,,3,Yes,200,**20 Per Box**
BH-BLACK-HARD-GG,BH-BLACK-HARD-GG,,0,1,,In Stock,3306,3306,,15''W x 15''D x 1.75''H,No,,89506 30114,,,,3,Yes,200,**20 Per Box**
BH-BRN-GG,BH-BRN-GG,,0,1,,In Stock,284,284,,16''W x 15.50''D x 1.75''H,No,,89506 38654,,,,2,Yes,250,**22 Per Box**
BH-BURG-GG,BH-BURG-GG,,0,1,,In Stock,1230,1230,,16''W x 15.50''D x 1.75''H,No,,89506 38654,,,,2,Yes,250,**22 Per Box**
BH-GOLD-HARD-VYL-GG,BH-GOLD-HARD-VYL-GG,,0,1,,In Stock,1550,1550,,15.50''W x 15.50''D x 2''H,No,,38654 89506,,,,3,Yes,200,**20 Per Box**
BH-H002-CRYSTAL-GG,BH-H002-CRYSTAL-GG,,0,1,,In Stock,105,105,,15.50''W x 18.25''D x 35''H,No,,30114,,,,9,Yes,175,**2 Per Box**
BH-H007-CRYSTAL-GG,BH-H007-CRYSTAL-GG,,0,1,,In Stock,174,174,,16''W x 19.25''D x 36''H,No,,30114,,,,9,Yes,175,**2 Per Box**
BH-ICE-CRYSTAL-GG,BH-ICE-CRYSTAL-GG,,0,1,,In Stock,3,3,,15.75''W x 20''D x 36.25''H,No,,30114,,,,12,Yes,250,**2 Per Box**
BH-IVORY-GG,BH-IVORY-GG,,0,1,,In Stock,3813,3813,,16''W x 15.50''D x 1.75''H,No,,38654 89506,,,,2,Yes,250,**22 Per Box**
BH-IVORY-HARD-GG,BH-IVORY-HARD-GG,,0,1,,In Stock,3840,3840,,15''W x 15''D x 1.75''H,No,,30114,,,,3,Yes,200,**20 Per Box**
BH-IVORY-HARD-VYL-GG,BH-IVORY-HARD-VYL-GG,,0,1,,In Stock,8033,8033,,15.50''W x 15.50''D x 2''H,No,,89506 38654,,,,3,Yes,200,**20 Per Box**
BH-K002-CRYSTAL-GG,BH-K002-CRYSTAL-GG,,0,1,,In Stock,6,6,,18''W x 21.25''D x 38''H,No,,30114,,,,9,Yes,175,**2 Per Box**
BH-SIL-HARD-VYL-GG,BH-SIL-HARD-VYL-GG,,0,1,,In Stock,2105,2105,,15.50''W x 15.50''D x 2''H,No,,89506 38654,,,,3,Yes,200,**20 Per Box**
BH-WH-HARD-GG,BH-WH-HARD-GG,,0,1,,In Stock,883,883,,15.50''W x 15.50''D x 2''H,No,,89506 38654,,,,3,Yes,200,**20 Per Box**
BH-WH-HARD-VYL-GG,BH-WH-HARD-VYL-GG,,0,1,,In Stock,2096,2096,,15.50''W x 15.50''D x 2''H,No,,38654 89506,,,,3,Yes,200,**20 Per Box**
BL-8801X-GG,BL-8801X-GG,2020-08-15,1,1,2020-08-15,Back Ordered,0,0,,13'' - 24.5''W x 22''D x 39'' - 41''H,No,,30114,,,,42,No,175,**1 Per Box**
BL-LB-8801X-D-BLK-GG,BL-LB-8801X-D-BLK-GG,,0,1,,In Stock,384,384,,,No,,30114,,,,48,No,100,
BL-LB-8801X-D-GG,BL-LB-8801X-D-GG,2020-07-19,1,1,2020-07-19,Back Ordered,0,0,,13'' - 26''W x 22''D x 43'' - 50.25''H,No,,30114,,,,47,No,125,**1 Per Box**
BL-LB-8803-GG,BL-LB-8803-GG,,0,1,,In Stock,4,4,,,No,,30114,,,,47,No,125,**1 Per Box**
BL-LB-8809-LEA-GG,BL-LB-8809-LEA-GG,,0,1,,In Stock,1,1,,,No,,30114,,,,47,No,125,**1 Per Box**
BL-LB-8816D-GG,BL-LB-8816D-GG,2020-08-09,1,1,2020-08-09,Back Ordered,0,0,,,No,,30114,,,,47,Yes,125,**1 Per Box**
BL-LB-8817-GG,BL-LB-8817-GG,2020-08-30,1,1,2020-08-30,Back Ordered,0,0,,,No,,30114,,,,47,No,125,**1 Per Box**
BL-X-5C-BK-LEA-GG,BL-X-5C-BK-LEA-GG,,0,1,,In Stock,56,56,,,No,,30114,,,,31.5,No,175,**1 Per Box**
BL-X-5C-GG,BL-X-5C-GG,,0,1,,In Stock,42,42,,,No,,30114,,,,31.5,No,175,**1 Per Box**
BL-X-5H-GG,BL-X-5H-GG,,0,1,,In Stock,45,45,,25.50''W x 24''D x 47.50'' - 52.50''H,No,,30114,,,,36.22,No,100,**1 Per Box**
BL-X-5M-BK-GG,BL-X-5M-BK-GG,,0,1,,In Stock,93,93,,24.50''W x 25.50''D x 37.50'' - 41.25''H,No,,30114 89506,,,,33,No,125,**1 Per Box**
BL-X-5M-BLUE-GG,BL-X-5M-BLUE-GG,2020-07-18,1,1,2020-07-18,Back Ordered,0,0,,,No,,30114,,,,33,No,125,**1 Per Box**
BL-X-5M-D-BK-LEA-GG,BL-X-5M-D-BK-LEA-GG,,0,1,,In Stock,1,1,,,No,,30114,,,,12,No,125,**1 Per Box**
BL-X-5M-D-BLUE-GG,BL-X-5M-D-BLUE-GG,,0,1,,In Stock,33,33,,,No,,30114,,,,12,No,125,**1 Per Box**
BL-X-5M-D-DKGY-GG,BL-X-5M-D-DKGY-GG,2020-07-18,1,1,2020-07-18,Back Ordered,0,0,,,No,,30114,,,,12,No,125,**1 Per Box**
BL-X-5M-D-GG,BL-X-5M-D-GG,2020-07-18,1,1,2020-07-18,Back Ordered,0,0,,24.50''W x 25.50''D x 43.25'' - 50.75''H,No,,30114,,,,38,No,125,**1 Per Box**
BL-X-5M-D-RED-GG,BL-X-5M-D-RED-GG,,0,1,,In Stock,1,1,,,No,,30114,,,,12,No,125,**1 Per Box**
BL-X-5M-D-WH-GG,BL-X-5M-D-WH-GG,2020-07-18,1,1,2020-07-18,Back Ordered,0,0,,,No,,30114,,,,12,No,125,**1 Per Box**
BL-X-5M-DKGY-GG,BL-X-5M-DKGY-GG,2020-07-17,1,1,2020-07-17,Back Ordered,0,0,,,No,,30114,,,,33,No,125,**1 Per Box**
BL-X-5M-GRN-GG,BL-X-5M-GRN-GG,2020-07-18,1,1,2020-07-18,Back Ordered,0,0,,,No,,30114,,,,33,No,125,**1 Per Box**
BL-X-5M-LEA-GG,BL-X-5M-LEA-GG,,0,1,,In Stock,206,206,,24.50''W x 25.50''D x 37.50'' - 41.25''H,No,,89506 30114,,,,33,No,125,**1 Per Box**
BL-X-5M-RED-GG,BL-X-5M-RED-GG,2020-07-18,1,1,2020-07-18,Back Ordered,0,0,,,No,,30114,,,,33,No,125,**1 Per Box**
BL-X-5M-WH-BK-GG,BL-X-5M-WH-BK-GG,2020-07-17,1,1,2020-07-17,Back Ordered,0,0,,,No,,30114,,,,33,No,125,**1 Per Box**
BL-X-5M-WH-BLUE-GG,BL-X-5M-WH-BLUE-GG,,0,1,,In Stock,2,2,,,No,,30114,,,,33,No,125,**1 Per Box**
BL-X-5M-WH-GG,BL-X-5M-WH-GG,,0,1,,In Stock,142,142,,,No,,30114,,,,33,No,125,**1 Per Box**
BL-X-5M-WH-GY-GG,BL-X-5M-WH-GY-GG,2020-07-17,1,1,2020-07-17,Back Ordered,0,0,,,No,,30114,,,,33,No,125,**1 Per Box**
BL-X-5M-WH-TAN-GG,BL-X-5M-WH-TAN-GG,,0,1,,In Stock,44,44,,,No,,30114,,,,33,No,125,**1 Per Box**
BL-X-5M-WH-WH-GG,BL-X-5M-WH-WH-GG,,0,1,,In Stock,38,38,,,No,,30114,,,,33,No,125,**1 Per Box**
BL-ZP-804-GG,BL-ZP-804-GG,,0,1,,In Stock,39,39,,26''W x 25''D x 36.50'' - 40.50''H,No,,89506 30114,,,,41.25,No,175,**1 Per Box**
BL-ZP-806-BK-GG,BL-ZP-806-BK-GG,,0,1,,In Stock,561,561,,25.75''W x 25''D x 39'' - 42.75''H,No,,89506 30114,,,,35.8,No,125,**1 Per Box**
BL-ZP-806-BK-LEA-GG,BL-ZP-806-BK-LEA-GG,2020-07-19,1,1,2020-07-19,Back Ordered,0,0,,25.75''W x 25''D x 39'' - 42.75''H,No,,89506 30114,,,,35.8,No,125,**1 Per Box**
BL-ZP-806-BL-GG,BL-ZP-806-BL-GG,2020-07-31,1,1,2020-07-31,Back Ordered,0,0,,25.75''W x 25''D x 39'' - 42.75''H,No,,30114,,,,35.8,No,125,**1 Per Box**
BL-ZP-806-BY-GG,BL-ZP-806-BY-GG,2020-07-24,1,1,2020-07-24,Back Ordered,0,0,,25.75''W x 25''D x 39'' - 42.75''H,No,,89506 30114,,,,35.8,No,125,**1 Per Box**
BL-ZP-806-GY-GG,BL-ZP-806-GY-GG,2020-07-19,1,1,2020-07-19,Back Ordered,0,0,,25.75''W x 25''D x 39'' - 42.75''H,No,,89506 30114,,,,35.8,No,125,**1 Per Box**
BL-ZP-806-WH-GG,BL-ZP-806-WH-GG,2020-07-18,1,1,2020-07-18,Back Ordered,0,0,,,No,,30114,,,,35.8,No,125,**1 Per Box**
BL-ZP-806C-GG,BL-ZP-806C-GG,,0,1,,In Stock,22,22,,,No,,30114,,,,34,No,175,**1 Per Box**
BL-ZP-809-BK-GG,BL-ZP-809-BK-GG,2020-07-18,1,1,2020-07-18,Back Ordered,0,0,,24.75''W x 24''D x 41.75'' - 45.50''H,No,,89506 30114,,,,38,No,125,**1 Per Box**
BL-ZP-809D-BK-GG,BL-ZP-809D-BK-GG,2020-07-18,1,1,2020-07-18,Back Ordered,0,0,,,No,,30114,,,,44,No,125,**1 Per Box**
BL-ZP-809D-DKGY-GG,BL-ZP-809D-DKGY-GG,,0,1,,In Stock,34,34,,,No,,30114,,,,44,No,125,**1 Per Box**
BL-ZP-8805-BK-GG,BL-ZP-8805-BK-GG,2020-07-24,1,1,2020-07-24,Back Ordered,0,0,,25.25''W x 24''D x 37.50'' - 42.25''H,No,,30114,,,,32.55,No,125,**1 Per Box**
BL-ZP-8805-GY-GG,BL-ZP-8805-GY-GG,2020-08-06,1,1,2020-08-06,Back Ordered,0,0,,25.25''W x 24''D x 37.50'' - 42.25''H,No,,30114,,,,32.55,No,125,**1 Per Box**
BL-ZP-8805C-GG,BL-ZP-8805C-GG,,0,1,,In Stock,101,101,,,No,,30114,,,,30.5,No,125,**1 Per Box**
BL-ZP-8805D-BK-GG,BL-ZP-8805D-BK-GG,2020-07-18,1,1,2020-07-18,Back Ordered,0,0,,,No,,30114,,,,36.5,No,175,**1 Per Box**
BL-ZP-8805D-BLUE-GG,BL-ZP-8805D-BLUE-GG,,0,1,,In Stock,5,5,,,No,,30114,,,,36.5,No,175,**1 Per Box**
BL-ZP-8805D-DKGY-GG,BL-ZP-8805D-DKGY-GG,2020-07-18,1,1,2020-07-18,Back Ordered,0,0,,,No,,30114,,,,36.5,No,175,**1 Per Box**
BL-ZP-8805D-WH-GG,BL-ZP-8805D-WH-GG,2020-07-18,1,1,2020-07-18,Back Ordered,0,0,,,No,,30114,,,,36.5,No,175,**1 Per Box**
BLN-6GCCHR2286-BK-GG,BLN-6GCCHR2286-BK-GG,,1,1,,Back Ordered,0,0,,,No,,30114,,,,255,Yes,100,
BLN-6GCCHR595M-BK-GG,BLN-6GCCHR595M-BK-GG,,0,1,,In Stock,40,40,,,No,,30114,,,,258,Yes,100,
BLN-6GCCHR595M2-BK-GG,BLN-6GCCHR595M2-BK-GG,,0,1,,In Stock,1,1,,,No,,30114,,,,264,Yes,125,
BLN-6GCCHRX000-BK-GG,BLN-6GCCHRX000-BK-GG,,0,1,,In Stock,56,56,,,No,,30114,,,,240,Yes,125,
BLN-6GCGRY2286-BK-GG,BLN-6GCGRY2286-BK-GG,,1,1,,Back Ordered,0,0,,,No,,30114,,,,255,Yes,100,
BLN-6GCGRY595M-BK-GG,BLN-6GCGRY595M-BK-GG,,1,1,,Back Ordered,0,0,,,No,,30114,,,,258,Yes,100,
BLN-6GCGRY595M2-BK-GG,BLN-6GCGRY595M2-BK-GG,,1,1,,Back Ordered,0,0,,,No,,30114,,,,264,Yes,125,
BLN-6GCGRYX000-BK-GG,BLN-6GCGRYX000-BK-GG,,1,1,,Back Ordered,0,0,,,No,,30114,,,,240,Yes,125,
BLN-6GCMHG2286-BK-GG,BLN-6GCMHG2286-BK-GG,,1,1,,Back Ordered,0,0,,,No,,30114,,,,255,Yes,100,
BLN-6GCMHG595M-BK-GG,BLN-6GCMHG595M-BK-GG,,0,1,,In Stock,40,40,,,No,,30114,,,,258,Yes,100,
BLN-6GCMHG595M2-BK-GG,BLN-6GCMHG595M2-BK-GG,,0,1,,In Stock,1,1,,,No,,30114,,,,264,Yes,125,
BLN-6GCMHGX000-BK-GG,BLN-6GCMHGX000-BK-GG,,0,1,,In Stock,56,56,,,No,,30114,,,,240,Yes,125,
BLN-CLIFAPPX5-BK-GG,BLN-CLIFAPPX5-BK-GG,,1,1,,Back Ordered,0,0,,,No,,30114,,,,111.34,Yes,125,**1 Per Box**
BLN-CLIFAPX5L-BK-GG,BLN-CLIFAPX5L-BK-GG,,1,1,,Back Ordered,0,0,,,No,,30114,,,,111.34,Yes,125,**1 Per Box**
BLN-CLIFCHPX5-BK-GG,BLN-CLIFCHPX5-BK-GG,,1,1,,Back Ordered,0,0,,,No,,30114,,,,112.34,Yes,125,**1 Per Box**
BLN-NAN219AP595M-WH-GG,BLN-NAN219AP595M-WH-GG,,0,1,,In Stock,40,40,,,No,,30114,,,,126.5,Yes,125,**1 Per Box**
BLN-NAN219CHP595M-WH-GG,BLN-NAN219CHP595M-WH-GG,,0,1,,In Stock,40,40,,,No,,30114,,,,127.5,Yes,125,**1 Per Box**
BLN-NAN21APX5L-BK-GG,BLN-NAN21APX5L-BK-GG,,0,1,,In Stock,54,54,,,No,,30114,,,,126,Yes,125,**1 Per Box**
BLN-NAN21CPX5L-BK-GG,BLN-NAN21CPX5L-BK-GG,,0,1,,In Stock,49,49,,,No,,30114,,,,127,Yes,125,**1 Per Box**
BLN-NAN28APX5-BK-GG,BLN-NAN28APX5-BK-GG,,1,1,,Back Ordered,0,0,,,No,,30114,,,,126,Yes,125,**1 Per Box**
BLN-NAN28CHPX5-BK-GG,BLN-NAN28CHPX5-BK-GG,,1,1,,Back Ordered,0,0,,,No,,30114,,,,127,Yes,125,**1 Per Box**
BLN-X10RSG1030-GN-GG,BLN-X10RSG1030-GN-GG,,1,1,,Back Ordered,0,0,,,No,,30114,,,,73,Yes,125,
BLN-X10RSG1030-RD-GG,BLN-X10RSG1030-RD-GG,,1,1,,Back Ordered,0,0,,,No,,30114,,,,73,Yes,125,
BLN-X10RSG1030-WH-GG,BLN-X10RSG1030-WH-GG,,1,1,,Back Ordered,0,0,,,No,,30114,,,,73,Yes,125,