"id","code","next-available","out-of-stock","orderable","Est Arrival Date","Status","Available Quantity","available-qty","free-ship-method","dimensions","ship-alone","flat-ship-rates","origin-zip","number-of-boxes","invalid-ship-methods","upsable","ship-weight","global-free-ship-exclusion","freight-class","outbound-shipping"
111-1-BK-GG,111-1-BK-GG,,0,1,,In Stock,91,91,,33.50''W x 31''D x 29''H,No,,38654 89506,,,,54,Yes,300,**1 Per Box**
111-1-BN-GG,111-1-BN-GG,,0,1,,In Stock,81,81,,33.50''W x 31''D x 29''H,No,,38654 89506,,,,54,Yes,300,**1 Per Box**
111-1-CG-GG,111-1-CG-GG,,0,1,,In Stock,64,64,,33.50''W x 31''D x 29''H,No,,30114,,,,54,Yes,300,**1 Per Box**
111-1-GY-GG,111-1-GY-GG,,0,1,,In Stock,37,37,,33.50''W x 31''D x 29''H,No,,30114,,,,54,Yes,300,**1 Per Box**
111-1-WH-GG,111-1-WH-GG,,0,1,,In Stock,81,81,,33.50''W x 31''D x 29''H,No,,38654 89506,,,,54,Yes,300,**1 Per Box**
111-2-BK-GG,111-2-BK-GG,,0,1,,In Stock,59,59,,52''W x 29''D x 29''H,No,,38654 89506,,,,74,Yes,300,**1 Per Box**
111-2-BN-GG,111-2-BN-GG,,0,1,,In Stock,9,9,,52''W x 29''D x 29''H,No,,38654 89506,,,,74,Yes,300,**1 Per Box**
111-2-CG-GG,111-2-CG-GG,,0,1,,In Stock,39,39,,52''W x 29''D x 29''H,No,,30114,,,,74,Yes,300,**1 Per Box**
111-2-GY-GG,111-2-GY-GG,,0,1,,In Stock,24,24,,52''W x 29''D x 29''H,No,,30114,,,,74,Yes,300,**1 Per Box**
111-2-WH-GG,111-2-WH-GG,,0,1,,In Stock,79,79,,52''W x 29''D x 29''H,No,,38654 89506,,,,74,Yes,300,**1 Per Box**
111-3-BK-GG,111-3-BK-GG,,0,1,,In Stock,40,40,,72.75''W x 29''D x 29''H,No,,38654 89506,,,,94,Yes,300,**1 Per Box**
111-3-BN-GG,111-3-BN-GG,,0,1,,In Stock,17,17,,72.75''W x 29''D x 29''H,No,,38654 89506,,,,94,Yes,300,**1 Per Box**
111-3-CG-GG,111-3-CG-GG,,0,1,,In Stock,29,29,,72.75''W x 29''D x 29''H,No,,30114,,,,94,Yes,300,**1 Per Box**
111-3-GY-GG,111-3-GY-GG,,0,1,,In Stock,31,31,,72.75''W x 29''D x 29''H,No,,30114,,,,94,Yes,300,**1 Per Box**
111-3-WH-GG,111-3-WH-GG,,0,1,,In Stock,21,21,,72.75''W x 29''D x 29''H,No,,38654 89506,,,,94,Yes,300,**1 Per Box**
111-SET-BK-GG,111-SET-BK-GG,,0,1,,In Stock,26,26,,33.50'' - 72.75''W x 29'' - 31''D x 29''H,No,,89506 38654,,,,222,Yes,300,**Item Ships in 3 Boxes**
111-SET-BN-GG,111-SET-BN-GG,,0,1,,In Stock,7,7,,33.50'' - 72.75''W x 29'' - 31''D x 29''H,No,,89506 38654,,,,222,Yes,300,**Item Ships in 3 Boxes**
111-SET-CG-GG,111-SET-CG-GG,,0,1,,In Stock,29,29,,33.50'' - 72.75''W x 29'' - 31''D x 29''H,No,,30114,,,,222,Yes,300,**Item Ships in 3 Boxes**
111-SET-GY-GG,111-SET-GY-GG,,0,1,,In Stock,24,24,,33.50'' - 72.75''W x 29'' - 31''D x 29''H,No,,30114,,,,222,Yes,300,**Item Ships in 3 Boxes**
111-SET-WH-GG,111-SET-WH-GG,,0,1,,In Stock,21,21,,33.50'' - 72.75''W x 29'' - 31''D x 29''H,No,,89506 38654,,,,222,Yes,300,**Item Ships in 3 Boxes**
2-ET-ER18345-24-DB-GG,2-ET-ER18345-24-DB-GG,,0,1,,In Stock,1,1,,,No,,30114,,,,21,Yes,125,**1 Per Box**
2-ET-ER18345-24-GY-GG,2-ET-ER18345-24-GY-GG,,0,1,,In Stock,1,1,,,No,,30114,,,,21,Yes,125,**1 Per Box**
2-ET-ER18345-24-LB-GG,2-ET-ER18345-24-LB-GG,,1,1,,Back Ordered,0,0,,,No,,30114,,,,21,Yes,125,**1 Per Box**
2-ET-ER18345-30-DB-GG,2-ET-ER18345-30-DB-GG,,0,1,,In Stock,135,135,,,No,,30114,,,,23,Yes,125,**1 Per Box**
2-ET-ER18345-30-GY-GG,2-ET-ER18345-30-GY-GG,,1,1,,Back Ordered,0,0,,,No,,30114,,,,23,Yes,125,**1 Per Box**
2-ET-ER18345-30-LB-GG,2-ET-ER18345-30-LB-GG,,0,1,,In Stock,1,1,,,No,,30114,,,,23,Yes,125,**1 Per Box**
2-ET-SWVLPTO-30-BK-GG,2-ET-SWVLPTO-30-BK-GG,,0,1,,In Stock,67,67,,,No,,30114,,,,60,Yes,85,**1 Per Box**
2-ET-SWVLPTO-30-GG,2-ET-SWVLPTO-30-GG,,0,1,,In Stock,103,103,,,No,,30114,,,,60,Yes,85,
2-TLH-SC-044-B-GG,2-TLH-SC-044-B-GG,,0,1,,In Stock,349,349,,,No,,30114,,,,27,No,175,**1 Per Box**
2-XU-2424-MAR-GG,2-XU-2424-MAR-GG,,1,0,,Temporarily Out of Stock,0,0,,,No,,30114,,,,20,Yes,70,**1 Per Box**
2-XU-2430-MAR-GG,2-XU-2430-MAR-GG,,1,0,,Temporarily Out of Stock,0,0,,,No,,30114,,,,30,Yes,70,**1 Per Box**
2-XU-2430-WD-GG,2-XU-2430-WD-GG,,1,0,,Temporarily Out of Stock,0,0,,,No,,30114,,,,30,Yes,70,**1 Per Box**
2-XU-2442-MAR-GG,2-XU-2442-MAR-GG,,1,0,,Temporarily Out of Stock,0,0,,,No,,30114,,,,,Yes,,
2-XU-2442-WD-GG,2-XU-2442-WD-GG,,1,0,,Temporarily Out of Stock,0,0,,,No,,30114,,,,,Yes,70,
2-XU-3030-MAR-GG,2-XU-3030-MAR-GG,,1,0,,Temporarily Out of Stock,0,0,,,No,,30114,,,,,Yes,,
2-XU-3030-WD-GG,2-XU-3030-WD-GG,,1,0,,Temporarily Out of Stock,0,0,,,No,,30114,,,,,Yes,110,
2-XU-3042-MAR-GG,2-XU-3042-MAR-GG,,1,0,,Temporarily Out of Stock,0,0,,,No,,30114,,,,,Yes,,
2-XU-3042-WD-GG,2-XU-3042-WD-GG,,1,0,,Temporarily Out of Stock,0,0,,,No,,30114,,,,,Yes,70,
2-XU-3048-MAR-GG,2-XU-3048-MAR-GG,,1,0,,Temporarily Out of Stock,0,0,,,No,,30114,,,,,Yes,,
2-XU-3048-WD-GG,2-XU-3048-WD-GG,,1,0,,Temporarily Out of Stock,0,0,,,No,,30114,,,,,Yes,70,
2-XU-3060-MAR-GG,2-XU-3060-MAR-GG,,1,0,,Temporarily Out of Stock,0,0,,,No,,30114,,,,,Yes,70,
2-XU-3060-WD-GG,2-XU-3060-WD-GG,,1,0,,Temporarily Out of Stock,0,0,,,No,,30114,,,,,Yes,70,
2-XU-3636-MAR-GG,2-XU-3636-MAR-GG,,1,0,,Temporarily Out of Stock,0,0,,,No,,30114,,,,,Yes,,
2-XU-3636-WD-GG,2-XU-3636-WD-GG,,1,0,,Temporarily Out of Stock,0,0,,,No,,30114,,,,,Yes,110,
2-XU-4242-MAR-GG,2-XU-4242-MAR-GG,,1,0,,Temporarily Out of Stock,0,0,,,No,,30114,,,,,Yes,,
2-XU-4242-WD-GG,2-XU-4242-WD-GG,,1,0,,Temporarily Out of Stock,0,0,,,No,,30114,,,,,Yes,150,
2-XU-RD-24-MAR-GG,2-XU-RD-24-MAR-GG,,1,0,,Temporarily Out of Stock,0,0,,,No,,30114,,,,20,Yes,70,**1 Per Box**
2-XU-RD-24-WD-GG,2-XU-RD-24-WD-GG,,1,0,,Temporarily Out of Stock,0,0,,,No,,30114,,,,20,Yes,70,**1 Per Box**
2-XU-RD-30-MAR-GG,2-XU-RD-30-MAR-GG,,1,0,,Temporarily Out of Stock,0,0,,,No,,30114,,,,30,Yes,70,**1 Per Box**
2-XU-RD-30-WD-GG,2-XU-RD-30-WD-GG,,1,0,,Temporarily Out of Stock,0,0,,,No,,30114,,,,30,Yes,110,**1 Per Box**
2-XU-RD-36-MAR-GG,2-XU-RD-36-MAR-GG,,1,0,,Temporarily Out of Stock,0,0,,,No,,30114,,,,,Yes,,
2-XU-RD-36-WD-GG,2-XU-RD-36-WD-GG,,1,0,,Temporarily Out of Stock,0,0,,,No,,30114,,,,,Yes,110,
2-XU-RD-42-MAR-GG,2-XU-RD-42-MAR-GG,,1,0,,Temporarily Out of Stock,0,0,,,No,,30114,,,,,Yes,,
2-XU-RD-42-WD-GG,2-XU-RD-42-WD-GG,,1,0,,Temporarily Out of Stock,0,0,,,No,,30114,,,,,Yes,100,
2-YU-YCX-001-NAT-GG,2-YU-YCX-001-NAT-GG,,0,1,,In Stock,58,58,,,No,,30114,,,,12,No,175,**1 Per Box**
2-YU-YCX-003-NAT-GG,2-YU-YCX-003-NAT-GG,2020-09-12,1,1,2020-09-12,Back Ordered,0,0,,,No,,30114,,,,10,No,175,**1 Per Box**
2-YU-YCX-011-RED-GG,2-YU-YCX-011-RED-GG,,0,1,,In Stock,25,25,,,No,,30114,,,,10,No,175,**1 Per Box**
222-1-BK-GG,222-1-BK-GG,,0,1,,In Stock,83,83,,31.25''W x 30''D x 31.25''H,No,,38654 89506,,,,60,Yes,300,**1 Per Box**
222-1-BN-GG,222-1-BN-GG,,0,1,,In Stock,96,96,,31.25''W x 30''D x 31.25''H,No,,38654 89506,,,,60,Yes,300,**1 Per Box**
222-2-BK-GG,222-2-BK-GG,2020-09-21,1,1,2020-09-21,Back Ordered,0,0,,51''W x 30''D x 31.25''H,No,,38654 89506,,,,82,Yes,300,**1 Per Box**
222-2-BN-GG,222-2-BN-GG,,0,1,,In Stock,31,31,,51''W x 30''D x 31.25''H,No,,38654 89506,,,,82,Yes,300,**1 Per Box**
222-3-BK-GG,222-3-BK-GG,,0,1,,In Stock,28,28,,68.50''W x 30''D x 31.25''H,No,,38654 89506,,,,102,Yes,300,**1 Per Box**
222-3-BN-GG,222-3-BN-GG,,0,1,,In Stock,73,73,,68.50''W x 30''D x 31.25''H,No,,38654 89506 30114,,,,102,Yes,300,**1 Per Box**
222-SET-BK-GG,222-SET-BK-GG,,1,1,,Back Ordered,0,0,,31.25'' - 68.50''W x 30''D x 31.25''H,No,,89506 38654,,,,244,Yes,300,**Item Ships in 3 Boxes**
222-SET-BN-GG,222-SET-BN-GG,,0,1,,In Stock,31,31,,31.25'' - 68.50''W x 30''D x 31.25''H,No,,89506 38654,,,,244,Yes,300,**Item Ships in 3 Boxes**
4-ET-31320-24-BK-R-GG,4-ET-31320-24-BK-R-GG,2020-11-11,1,1,2020-11-11,Back Ordered,0,0,,,No,,30114,,,,11,Yes,175,**1 Per Box**
4-ET-31320-24-GN-R-GG,4-ET-31320-24-GN-R-GG,,0,1,,In Stock,90,90,,,No,,30114,,,,11,Yes,175,**1 Per Box**
4-ET-31320-24-SV-R-GG,4-ET-31320-24-SV-R-GG,,0,1,,In Stock,250,250,,,No,,30114,,,,11,Yes,175,**1 Per Box**
4-ET-31320-24-TL-R-GG,4-ET-31320-24-TL-R-GG,2020-11-06,1,1,2020-11-06,Back Ordered,0,0,,,No,,30114,,,,11,Yes,175,**1 Per Box**
4-ET-31320-30-BK-R-GG,4-ET-31320-30-BK-R-GG,,0,1,,In Stock,1455,1455,,,No,,30114,,,,11.5,Yes,175,**1 Per Box**
4-ET-31320-30-GN-R-GG,4-ET-31320-30-GN-R-GG,,0,1,,In Stock,1773,1773,,,No,,30114,,,,11.5,Yes,175,**1 Per Box**
4-ET-31320-30-SV-R-GG,4-ET-31320-30-SV-R-GG,,0,1,,In Stock,1887,1887,,,No,,30114,,,,11.5,Yes,175,**1 Per Box**
4-ET-31320-30-TL-R-GG,4-ET-31320-30-TL-R-GG,2020-11-06,1,1,2020-11-06,Back Ordered,0,0,,,No,,30114,,,,11.5,Yes,175,**1 Per Box**
4-JJ-303C-B-GG,4-JJ-303C-B-GG,2020-09-20,1,1,2020-09-20,Back Ordered,0,0,,,No,,30114,,,,50,Yes,175,**1 Per Box**
4-JJ-303C-G-GG,4-JJ-303C-G-GG,2020-09-20,1,1,2020-09-20,Back Ordered,0,0,,,No,,30114,,,,50,Yes,175,**1 Per Box**
4-JJ-303C-GG,4-JJ-303C-GG,2020-08-31,1,1,2020-08-31,Back Ordered,0,0,,,No,,30114,,,,50,Yes,175,**1 Per Box**
4-YU-YCX4-001-NAT-GG,4-YU-YCX4-001-NAT-GG,,0,1,,In Stock,29,29,,,No,,30114,,,,19.1,Yes,175,**1 Per Box**
4-YU-YCX4-003-GREEN-GG,4-YU-YCX4-003-GREEN-GG,,0,1,,In Stock,269,269,,,No,,30114,,,,13,Yes,175,**1 Per Box**
4-YU-YCX4-011-RED-GG,4-YU-YCX4-011-RED-GG,,0,1,,In Stock,12,12,,,No,,30114,,,,16,Yes,125,**1 Per Box**
627FABRIC-BCG-SB,627FABRIC-BCG-SB,,0,1,,In Stock,9,9,,,No,,30114,,,,18,Yes,125,**4 Per Box**
801L-LF0005-BK-LEA-GG,801L-LF0005-BK-LEA-GG,,0,1,,In Stock,186,186,,33''W x 33''D x 43.50'' - 47''H,No,,30114 89506,,,,57,No,175,**1 Per Box**
801L-LF0019-BY-LEA-GG,801L-LF0019-BY-LEA-GG,,0,1,,In Stock,38,38,,33''W x 33''D x 43.50'' - 47''H,No,,30114 89506,,,,57,No,175,**1 Per Box**
802-BRN-GG,802-BRN-GG,,0,1,,In Stock,92,92,,26''W x 21.25''D x 43.75'' - 47.25''H,No,,30114 89506,,,,57,No,175,**1 Per Box**
827FABRIC-BCG-SB,827FABRIC-BCG-SB,,0,1,,In Stock,1382,1382,,,No,,30114,,,,18,Yes,125,**4 Per Box**
ADV-SSC-12BLK,ADV-SSC-12BLK,,0,1,,In Stock,274,274,,,No,,30114,,,,5.82,Yes,175,**5 Per Box**
ADV-SSC-12NAVY,ADV-SSC-12NAVY,,0,1,,In Stock,425,425,,,No,,30114,,,,5.82,Yes,175,**5 Per Box**
ADV-SSC-14BLK,ADV-SSC-14BLK,2020-10-02,1,1,2020-10-02,Back Ordered,0,0,,,No,,30114,,,,6,Yes,125,**5 Per Box**
ADV-SSC-14NAVY,ADV-SSC-14NAVY,,0,1,,In Stock,61,61,,,No,,30114,,,,6,Yes,125,**5 Per Box**
ADV-SSC-16BLK,ADV-SSC-16BLK,2020-09-13,1,1,2020-09-13,Back Ordered,0,0,,,No,,30114,,,,9,Yes,125,**4 Per Box**
ADV-SSC-16NAVY,ADV-SSC-16NAVY,,0,1,,In Stock,378,378,,,No,,30114,,,,9,Yes,125,**4 Per Box**
ADV-SSC-18BLK,ADV-SSC-18BLK,,0,1,,In Stock,82,82,,,No,,30114,,,,9.44,Yes,175,**4 Per Box**
ADV-SSC-18NAVY,ADV-SSC-18NAVY,2020-09-13,1,1,2020-09-13,Back Ordered,0,0,,,No,,30114,,,,9.44,Yes,175,**4 Per Box**
ADV-TITAN-18BLK,ADV-TITAN-18BLK,,0,1,,In Stock,1005,1005,,,No,,30114,,,,12,Yes,175,**3 Per Box**
ADV-TITAN-18NAVY,ADV-TITAN-18NAVY,,0,1,,In Stock,610,610,,,No,,30114,,,,12,Yes,175,**3 Per Box**
ADV-TITAN-TASKBLK,ADV-TITAN-TASKBLK,,0,1,,In Stock,19,19,,,No,,30114,,,,20,Yes,125,**1 Per Box**
ADV-TITAN-TASKNAVY,ADV-TITAN-TASKNAVY,,0,1,,In Stock,210,210,,,No,,30114,,,,20,Yes,125,**1 Per Box**
AM-9460-5861-GG,AM-9460-5861-GG,,1,1,,Out of Stock,0,0,,41.50''W x 43'' - 67''D x 43.50''H,No,,38654,,,,125,Yes,300,**Item Ships in 2 Boxes**
AM-H9460-5860-GG,AM-H9460-5860-GG,,1,1,,Back Ordered,0,0,,41.50''W x 43'' - 67''D x 43.50''H,No,,38654,,,,120,Yes,300,**Item Ships in 2 Boxes**
AM-H9460-5861-GG,AM-H9460-5861-GG,,1,1,,Back Ordered,0,0,,41.50''W x 43'' - 67''D x 43.50''H,No,,38654,,,,120,Yes,300,**Item Ships in 2 Boxes**
AM-H9460-5983-GG,AM-H9460-5983-GG,,1,1,,Back Ordered,0,0,,41.50''W x 43'' - 67''D x 43.50''H,No,,38654,,,,120,Yes,300,**Item Ships in 2 Boxes**
AM-H9560-6450-GG,AM-H9560-6450-GG,,1,1,,Back Ordered,0,0,,39''W x 43'' - 73''D x 46''H,No,,38654,,,,120,Yes,300,**Item Ships in 2 Boxes**
AW-MC309AF-BG-GG,AW-MC309AF-BG-GG,2020-09-27,1,1,2020-09-27,Back Ordered,0,0,,18.75''W x 18''D x 30''H,No,,30114,,,,11,Yes,85,**4 Per Box**
AW-MC309AF-BLK-GG,AW-MC309AF-BLK-GG,2020-09-27,1,1,2020-09-27,Back Ordered,0,0,,18.75''W x 18''D x 30''H,No,,89506 30114,,,,11,Yes,85,**4 Per Box**
AW-MC309AF-BRN-GG,AW-MC309AF-BRN-GG,,0,1,,In Stock,3,3,,18.75''W x 18''D x 30''H,No,,30114 89506,,,,11,Yes,85,**4 Per Box**
AW-MC320AF-BG-EMB-GG,AW-MC320AF-BG-EMB-GG,,1,1,,Out of Stock,0,0,,18''W x 20''D x 29.50''H,No,,30114,,,,11.6,Yes,85,**4 Per Box**
AW-MC320AF-BG-GG,AW-MC320AF-BG-GG,,0,1,,In Stock,1,1,,18''W x 20''D x 29.50''H,No,,30114,,,,11.6,Yes,85,**4 Per Box**
AW-MC320AF-BK-EMB-GG,AW-MC320AF-BK-EMB-GG,,1,1,,Out of Stock,0,0,,18''W x 20''D x 29.50''H,No,,30114,,,,11.6,Yes,85,**4 Per Box**
AW-MC320AF-BK-GG,AW-MC320AF-BK-GG,2020-11-06,1,1,2020-11-06,Back Ordered,0,0,,18''W x 20''D x 29.50''H,No,,30114,,,,11.6,Yes,85,**4 Per Box**
AW-MC320AF-GRY-EMB-GG,AW-MC320AF-GRY-EMB-GG,,1,1,,Out of Stock,0,0,,18''W x 20''D x 29.50''H,No,,30114,,,,11.6,Yes,85,**4 Per Box**
AW-MC320AF-GRY-GG,AW-MC320AF-GRY-GG,2020-10-22,1,1,2020-10-22,Back Ordered,0,0,,18''W x 20''D x 29.50''H,No,,30114,,,,11.6,Yes,85,**4 Per Box**
AW-MC320AF-NVY-EMB-GG,AW-MC320AF-NVY-EMB-GG,,1,1,,Out of Stock,0,0,,18''W x 20''D x 29.50''H,No,,30114,,,,11.6,Yes,85,**2 Per Box**
AW-MC320AF-NVY-GG,AW-MC320AF-NVY-GG,2020-09-27,1,1,2020-09-27,Back Ordered,0,0,,18''W x 20''D x 29.50''H,No,,30114,,,,11.6,Yes,85,**4 Per Box**
B-Z100-BLACK-GG,B-Z100-BLACK-GG,,0,1,,In Stock,87,87,,24''W x 27''D x 31.50''H,No,,89506 30114,,,,27.62,No,175,**1 Per Box**
B-Z100-BRN-GG,B-Z100-BRN-GG,,0,1,,In Stock,53,53,,24''W x 27''D x 31.50''H,No,,30114 89506,,,,27.62,No,175,**1 Per Box**
B-Z100-GY-GG,B-Z100-GY-GG,,0,1,,In Stock,96,96,,24''W x 27''D x 31.50''H,No,,30114,,,,27.62,No,175,**1 Per Box**
B-Z100-LF-0005-BK-LEA-GG,B-Z100-LF-0005-BK-LEA-GG,,0,1,,In Stock,117,117,,24''W x 27''D x 31.50''H,No,,89506,,,,27.62,No,175,**1 Per Box**
B-Z100-LF19-LEA-GG,B-Z100-LF19-LEA-GG,,0,1,,In Stock,243,243,,24''W x 27''D x 31.50''H,No,,30114 89506,,,,27.62,No,175,**1 Per Box**
B-Z100-NAVY-GG,B-Z100-NAVY-GG,,0,1,,In Stock,170,170,,24''W x 27''D x 31.50''H,No,,30114 89506,,,,27.62,No,175,**1 Per Box**
B-Z100-OXBLOOD-GG,B-Z100-OXBLOOD-GG,,0,1,,In Stock,114,114,,24''W x 27''D x 31.50''H,No,,30114,,,,27.62,No,175,**1 Per Box**
B-Z105-BLACK-GG,B-Z105-BLACK-GG,,0,1,,In Stock,147,147,,24''W x 27''D x 31.50''H,No,,30114 89506,,,,27.62,No,175,**1 Per Box**
B-Z105-BRN-GG,B-Z105-BRN-GG,,0,1,,In Stock,214,214,,24''W x 27''D x 31.50''H,No,,30114 89506,,,,27.62,No,175,**1 Per Box**
B-Z105-GY-GG,B-Z105-GY-GG,,0,1,,In Stock,54,54,,24''W x 27''D x 31.50''H,No,,30114,,,,27.62,No,175,**1 Per Box**
B-Z105-LF-0005-BK-LEA-GG,B-Z105-LF-0005-BK-LEA-GG,,0,1,,In Stock,285,285,,24''W x 27''D x 31.50''H,No,,30114 89506,,,,27.62,No,175,**1 Per Box**
B-Z105-LF19-LEA-GG,B-Z105-LF19-LEA-GG,,0,1,,In Stock,158,158,,24''W x 27''D x 31.50''H,No,,89506,,,,27.62,No,175,**1 Per Box**
B-Z105-NAVY-GG,B-Z105-NAVY-GG,,0,1,,In Stock,206,206,,24''W x 27''D x 31.50''H,No,,30114 89506,,,,27.62,No,175,**1 Per Box**
B-Z105-OXBLOOD-GG,B-Z105-OXBLOOD-GG,,0,1,,In Stock,114,114,,24''W x 27''D x 31.50''H,No,,30114 89506,,,,27.62,No,175,**1 Per Box**
BD-F002-BGE-GG,BD-F002-BGE-GG,,0,1,,In Stock,8697,8697,,18''W x 18''D x 30.5''H,No,,30114,,,,8,Yes,85,**4 Per Box**
BD-F002-BK-GG,BD-F002-BK-GG,,0,1,,In Stock,3405,3405,,18''W x 18''D x 30.5''H,No,,30114,,,,8,Yes,85,**4 Per Box**
BD-F002-GY-GG,BD-F002-GY-GG,,0,1,,In Stock,13925,13925,,18''W x 18''D x 30.5''H,No,,30114,,,,8,Yes,85,**4 Per Box**
BD-F002-RED-GG,BD-F002-RED-GG,2020-09-27,1,1,2020-09-27,Back Ordered,0,0,,18''W x 18''D x 30.5''H,No,,30114,,,,8,Yes,85,**4 Per Box**
BH-BK-HARD-VYL-GG,BH-BK-HARD-VYL-GG,,0,1,,In Stock,140,140,,15.50''W x 15.50''D x 2''H,No,,38654 89506,,,,3,Yes,200,**20 Per Box**
BH-BLACK-HARD-GG,BH-BLACK-HARD-GG,,0,1,,In Stock,2927,2927,,15''W x 15''D x 1.75''H,No,,89506 30114,,,,3,Yes,200,**20 Per Box**
BH-BRN-GG,BH-BRN-GG,,0,1,,In Stock,369,369,,16''W x 15.50''D x 1.75''H,No,,89506 38654,,,,2,Yes,250,**22 Per Box**
BH-BURG-GG,BH-BURG-GG,,0,1,,In Stock,673,673,,16''W x 15.50''D x 1.75''H,No,,89506 38654,,,,2,Yes,250,**22 Per Box**
BH-GOLD-HARD-VYL-GG,BH-GOLD-HARD-VYL-GG,,0,1,,In Stock,1182,1182,,15.50''W x 15.50''D x 2''H,No,,38654 89506,,,,3,Yes,200,**20 Per Box**
BH-H002-CRYSTAL-GG,BH-H002-CRYSTAL-GG,2020-09-28,1,1,2020-09-28,Back Ordered,0,0,,15.50''W x 18.25''D x 35''H,No,,30114,,,,9,Yes,175,**2 Per Box**
BH-H007-CRYSTAL-GG,BH-H007-CRYSTAL-GG,,0,1,,In Stock,121,121,,16''W x 19.25''D x 36''H,No,,30114,,,,9,Yes,175,**2 Per Box**
BH-ICE-CRYSTAL-GG,BH-ICE-CRYSTAL-GG,2020-08-31,0,1,2020-08-31,Out of Stock,0,0,,15.75''W x 20''D x 36.25''H,No,,30114,,,,12,Yes,250,**2 Per Box**
BH-IVORY-GG,BH-IVORY-GG,,0,1,,In Stock,2939,2939,,16''W x 15.50''D x 1.75''H,No,,38654 89506,,,,2,Yes,250,**22 Per Box**
BH-IVORY-HARD-GG,BH-IVORY-HARD-GG,,0,1,,In Stock,3721,3721,,15''W x 15''D x 1.75''H,No,,30114,,,,3,Yes,200,**20 Per Box**
BH-IVORY-HARD-VYL-GG,BH-IVORY-HARD-VYL-GG,,0,1,,In Stock,6593,6593,,15.50''W x 15.50''D x 2''H,No,,89506 38654,,,,3,Yes,200,**20 Per Box**
BH-K002-CRYSTAL-GG,BH-K002-CRYSTAL-GG,2020-08-31,1,1,2020-08-31,Back Ordered,0,0,,18''W x 21.25''D x 38''H,No,,30114,,,,9,Yes,175,**2 Per Box**
BH-SIL-HARD-VYL-GG,BH-SIL-HARD-VYL-GG,,0,1,,In Stock,1760,1760,,15.50''W x 15.50''D x 2''H,No,,89506 38654,,,,3,Yes,200,**20 Per Box**
BH-WH-HARD-GG,BH-WH-HARD-GG,,0,1,,In Stock,558,558,,15.50''W x 15.50''D x 2''H,No,,89506 38654,,,,3,Yes,200,**20 Per Box**
BH-WH-HARD-VYL-GG,BH-WH-HARD-VYL-GG,,0,1,,In Stock,1912,1912,,15.50''W x 15.50''D x 2''H,No,,38654 89506,,,,3,Yes,200,**20 Per Box**
BL-8801X-GG,BL-8801X-GG,2020-09-03,1,1,2020-09-03,Back Ordered,0,0,,13'' - 24.5''W x 22''D x 39'' - 41''H,No,,30114,,,,42,No,175,**1 Per Box**
BL-LB-8801X-D-BLK-GG,BL-LB-8801X-D-BLK-GG,2020-11-13,1,1,2020-11-13,Back Ordered,0,0,,,No,,30114,,,,48,No,100,
BL-LB-8801X-D-GG,BL-LB-8801X-D-GG,,0,1,,In Stock,165,165,,13'' - 26''W x 22''D x 43'' - 50.25''H,No,,30114,,,,47,No,125,**1 Per Box**
BL-LB-8803-GG,BL-LB-8803-GG,2020-09-13,1,1,2020-09-13,Back Ordered,0,0,,,No,,30114,,,,47,No,125,**1 Per Box**
BL-LB-8809-LEA-GG,BL-LB-8809-LEA-GG,2020-09-13,1,1,2020-09-13,Back Ordered,0,0,,,No,,30114,,,,47,No,125,**1 Per Box**
BL-LB-8816D-GG,BL-LB-8816D-GG,,0,1,,In Stock,17,17,,,No,,30114,,,,47,Yes,125,**1 Per Box**
BL-LB-8817-GG,BL-LB-8817-GG,2020-09-13,1,1,2020-09-13,Back Ordered,0,0,,,No,,30114,,,,47,No,125,**1 Per Box**
BL-X-5C-BK-LEA-GG,BL-X-5C-BK-LEA-GG,,0,1,,In Stock,95,95,,,No,,30114,,,,31.5,No,175,**1 Per Box**
BL-X-5C-GG,BL-X-5C-GG,,0,1,,In Stock,201,201,,,No,,30114,,,,31.5,No,175,**1 Per Box**
BL-X-5H-GG,BL-X-5H-GG,,0,1,,In Stock,234,234,,25.50''W x 24''D x 47.50'' - 52.50''H,No,,30114,,,,36.22,No,100,**1 Per Box**
BL-X-5M-BK-GG,BL-X-5M-BK-GG,,0,1,,In Stock,434,434,,24.50''W x 25.50''D x 37.50'' - 41.25''H,No,,30114 89506,,,,33,No,125,**1 Per Box**
BL-X-5M-BLUE-GG,BL-X-5M-BLUE-GG,,0,1,,In Stock,26,26,,,No,,30114,,,,33,No,125,**1 Per Box**
BL-X-5M-D-BK-LEA-GG,BL-X-5M-D-BK-LEA-GG,2020-10-17,1,1,2020-10-17,Back Ordered,0,0,,,No,,30114,,,,12,No,125,**1 Per Box**
BL-X-5M-D-BLUE-GG,BL-X-5M-D-BLUE-GG,2020-10-03,1,1,2020-10-03,Back Ordered,0,0,,,No,,30114,,,,12,No,125,**1 Per Box**
BL-X-5M-D-DKGY-GG,BL-X-5M-D-DKGY-GG,2020-09-22,1,1,2020-09-22,Back Ordered,0,0,,,No,,30114,,,,12,No,125,**1 Per Box**
BL-X-5M-D-GG,BL-X-5M-D-GG,,0,1,,In Stock,557,557,,24.50''W x 25.50''D x 43.25'' - 50.75''H,No,,30114,,,,38,No,125,**1 Per Box**
BL-X-5M-D-RED-GG,BL-X-5M-D-RED-GG,,0,1,,In Stock,1,1,,,No,,30114,,,,12,No,125,**1 Per Box**
BL-X-5M-D-WH-GG,BL-X-5M-D-WH-GG,2020-10-03,1,1,2020-10-03,Back Ordered,0,0,,,No,,30114,,,,12,No,125,**1 Per Box**
BL-X-5M-DKGY-GG,BL-X-5M-DKGY-GG,2020-09-13,1,1,2020-09-13,Back Ordered,0,0,,,No,,30114,,,,33,No,125,**1 Per Box**
BL-X-5M-GRN-GG,BL-X-5M-GRN-GG,2020-09-22,1,1,2020-09-22,Back Ordered,0,0,,,No,,30114,,,,33,No,125,**1 Per Box**
BL-X-5M-LEA-GG,BL-X-5M-LEA-GG,,0,1,,In Stock,1056,1056,,24.50''W x 25.50''D x 37.50'' - 41.25''H,No,,89506 30114,,,,33,No,125,**1 Per Box**
BL-X-5M-RED-GG,BL-X-5M-RED-GG,2020-09-06,1,1,2020-09-06,Back Ordered,0,0,,,No,,30114,,,,33,No,125,**1 Per Box**
BL-X-5M-WH-BK-GG,BL-X-5M-WH-BK-GG,2020-09-13,1,1,2020-09-13,Back Ordered,0,0,,,No,,30114,,,,33,No,125,**1 Per Box**
BL-X-5M-WH-BLUE-GG,BL-X-5M-WH-BLUE-GG,2020-09-03,1,1,2020-09-03,Back Ordered,0,0,,,No,,30114,,,,33,No,125,**1 Per Box**
BL-X-5M-WH-GG,BL-X-5M-WH-GG,2020-09-06,1,1,2020-09-06,Back Ordered,0,0,,,No,,30114,,,,33,No,125,**1 Per Box**
BL-X-5M-WH-GY-GG,BL-X-5M-WH-GY-GG,2020-09-22,1,1,2020-09-22,Back Ordered,0,0,,,No,,30114,,,,33,No,125,**1 Per Box**
BL-X-5M-WH-TAN-GG,BL-X-5M-WH-TAN-GG,2020-09-03,1,1,2020-09-03,Back Ordered,0,0,,,No,,30114,,,,33,No,125,**1 Per Box**
BL-X-5M-WH-WH-GG,BL-X-5M-WH-WH-GG,,0,1,,In Stock,16,16,,,No,,30114,,,,33,No,125,**1 Per Box**
BL-ZP-804-GG,BL-ZP-804-GG,,0,1,,In Stock,81,81,,26''W x 25''D x 36.50'' - 40.50''H,No,,89506 30114,,,,41.25,No,175,**1 Per Box**
BL-ZP-806-BK-GG,BL-ZP-806-BK-GG,,0,1,,In Stock,7,7,,25.75''W x 25''D x 39'' - 42.75''H,No,,89506 30114,,,,35.8,No,125,**1 Per Box**
BL-ZP-806-BK-LEA-GG,BL-ZP-806-BK-LEA-GG,,0,1,,In Stock,7,7,,25.75''W x 25''D x 39'' - 42.75''H,No,,89506 30114,,,,35.8,No,125,**1 Per Box**
BL-ZP-806-BL-GG,BL-ZP-806-BL-GG,,0,1,,In Stock,144,144,,25.75''W x 25''D x 39'' - 42.75''H,No,,30114,,,,35.8,No,125,**1 Per Box**
BL-ZP-806-BY-GG,BL-ZP-806-BY-GG,,0,1,,In Stock,179,179,,25.75''W x 25''D x 39'' - 42.75''H,No,,89506 30114,,,,35.8,No,125,**1 Per Box**
BL-ZP-806-GY-GG,BL-ZP-806-GY-GG,,0,1,,In Stock,115,115,,25.75''W x 25''D x 39'' - 42.75''H,No,,89506 30114,,,,35.8,No,125,**1 Per Box**
BL-ZP-806-WH-GG,BL-ZP-806-WH-GG,,0,1,,In Stock,35,35,,,No,,30114,,,,35.8,No,125,**1 Per Box**
BL-ZP-806C-GG,BL-ZP-806C-GG,,0,1,,In Stock,9,9,,,No,,30114,,,,34,No,175,**1 Per Box**
BL-ZP-809-BK-GG,BL-ZP-809-BK-GG,,0,1,,In Stock,215,215,,24.75''W x 24''D x 41.75'' - 45.50''H,No,,89506 30114,,,,38,No,125,**1 Per Box**
BL-ZP-809D-BK-GG,BL-ZP-809D-BK-GG,,0,1,,In Stock,359,359,,,No,,30114,,,,44,No,125,**1 Per Box**
BL-ZP-809D-DKGY-GG,BL-ZP-809D-DKGY-GG,,0,1,,In Stock,213,213,,,No,,30114,,,,44,No,125,**1 Per Box**
BL-ZP-8805-BK-GG,BL-ZP-8805-BK-GG,,0,1,,In Stock,152,152,,25.25''W x 24''D x 37.50'' - 42.25''H,No,,30114,,,,32.55,No,125,**1 Per Box**
BL-ZP-8805-GY-GG,BL-ZP-8805-GY-GG,,0,1,,In Stock,26,26,,25.25''W x 24''D x 37.50'' - 42.25''H,No,,30114,,,,32.55,No,125,**1 Per Box**
BL-ZP-8805C-GG,BL-ZP-8805C-GG,,0,1,,In Stock,63,63,,,No,,30114,,,,30.5,No,125,**1 Per Box**
BL-ZP-8805D-BK-GG,BL-ZP-8805D-BK-GG,,0,1,,In Stock,1,1,,,No,,30114,,,,36.5,No,175,**1 Per Box**
BL-ZP-8805D-BLUE-GG,BL-ZP-8805D-BLUE-GG,,0,1,,In Stock,2,2,,,No,,30114,,,,36.5,No,175,**1 Per Box**
BL-ZP-8805D-DKGY-GG,BL-ZP-8805D-DKGY-GG,2020-09-22,1,1,2020-09-22,Back Ordered,0,0,,,No,,30114,,,,36.5,No,175,**1 Per Box**
BL-ZP-8805D-WH-GG,BL-ZP-8805D-WH-GG,,0,1,,In Stock,1,1,,,No,,30114,,,,36.5,No,175,**1 Per Box**
BLN-6GCCHR2286-BK-GG,BLN-6GCCHR2286-BK-GG,,1,1,,Back Ordered,0,0,,,No,,30114,,,,255,Yes,100,
BLN-6GCCHR595M-BK-GG,BLN-6GCCHR595M-BK-GG,,0,1,,In Stock,23,23,,,No,,30114,,,,258,Yes,100,
BLN-6GCCHR595M2-BK-GG,BLN-6GCCHR595M2-BK-GG,,1,1,,Back Ordered,0,0,,,No,,30114,,,,264,Yes,125,
BLN-6GCCHRX000-BK-GG,BLN-6GCCHRX000-BK-GG,,0,1,,In Stock,1,1,,,No,,30114,,,,240,Yes,125,
BLN-6GCGRY2286-BK-GG,BLN-6GCGRY2286-BK-GG,,1,1,,Back Ordered,0,0,,,No,,30114,,,,255,Yes,100,
BLN-6GCGRY595M-BK-GG,BLN-6GCGRY595M-BK-GG,,1,1,,Back Ordered,0,0,,,No,,30114,,,,258,Yes,100,
BLN-6GCGRY595M2-BK-GG,BLN-6GCGRY595M2-BK-GG,,1,1,,Back Ordered,0,0,,,No,,30114,,,,264,Yes,125,
BLN-6GCGRYX000-BK-GG,BLN-6GCGRYX000-BK-GG,,0,1,,In Stock,27,27,,,No,,30114,,,,240,Yes,125,
BLN-6GCMHG2286-BK-GG,BLN-6GCMHG2286-BK-GG,,1,1,,Back Ordered,0,0,,,No,,30114,,,,255,Yes,100,
BLN-6GCMHG595M-BK-GG,BLN-6GCMHG595M-BK-GG,,0,1,,In Stock,23,23,,,No,,30114,,,,258,Yes,100,
BLN-6GCMHG595M2-BK-GG,BLN-6GCMHG595M2-BK-GG,,1,1,,Back Ordered,0,0,,,No,,30114,,,,264,Yes,125,
BLN-6GCMHGX000-BK-GG,BLN-6GCMHGX000-BK-GG,,0,1,,In Stock,1,1,,,No,,30114,,,,240,Yes,125,
BLN-CLIFAPPX5-BK-GG,BLN-CLIFAPPX5-BK-GG,,1,1,,Back Ordered,0,0,,,No,,30114,,,,111.34,Yes,125,**1 Per Box**