"id","code","next-available","out-of-stock","orderable","Est Arrival Date","Status","Available Quantity","available-qty","free-ship-method","dimensions","ship-alone","flat-ship-rates","origin-zip","number-of-boxes","invalid-ship-methods","upsable","ship-weight","global-free-ship-exclusion","freight-class","outbound-shipping"
111-1-BK-GG,111-1-BK-GG,,0,1,,In Stock,79,79,,33.50''W x 31''D x 29''H,No,,38654 89506,,,,54,Yes,300,**1 Per Box**
111-1-BN-GG,111-1-BN-GG,,0,1,,In Stock,15,15,,33.50''W x 31''D x 29''H,No,,38654 89506,,,,54,Yes,300,**1 Per Box**
111-1-CG-GG,111-1-CG-GG,,0,1,,In Stock,35,35,,33.50''W x 31''D x 29''H,No,,30114,,,,54,Yes,300,**1 Per Box**
111-1-GY-GG,111-1-GY-GG,,0,1,,In Stock,6,6,,33.50''W x 31''D x 29''H,No,,30114,,,,54,Yes,300,**1 Per Box**
111-1-WH-GG,111-1-WH-GG,,0,1,,In Stock,54,54,,33.50''W x 31''D x 29''H,No,,38654 89506,,,,54,Yes,300,**1 Per Box**
111-2-BK-GG,111-2-BK-GG,,0,1,,In Stock,28,28,,52''W x 29''D x 29''H,No,,38654 89506,,,,74,Yes,300,**1 Per Box**
111-2-BN-GG,111-2-BN-GG,2021-01-02,1,1,2021-01-02,Back Ordered,0,0,,52''W x 29''D x 29''H,No,,38654 89506,,,,74,Yes,300,**1 Per Box**
111-2-CG-GG,111-2-CG-GG,,0,1,,In Stock,25,25,,52''W x 29''D x 29''H,No,,30114,,,,74,Yes,300,**1 Per Box**
111-2-GY-GG,111-2-GY-GG,,0,1,,In Stock,25,25,,52''W x 29''D x 29''H,No,,30114,,,,74,Yes,300,**1 Per Box**
111-2-WH-GG,111-2-WH-GG,,0,1,,In Stock,63,63,,52''W x 29''D x 29''H,No,,38654 89506,,,,74,Yes,300,**1 Per Box**
111-3-BK-GG,111-3-BK-GG,,0,1,,In Stock,1,1,,72.75''W x 29''D x 29''H,No,,38654 89506,,,,94,Yes,300,**1 Per Box**
111-3-BN-GG,111-3-BN-GG,2020-12-21,1,1,2020-12-21,Back Ordered,0,0,,72.75''W x 29''D x 29''H,No,,38654 89506,,,,94,Yes,300,**1 Per Box**
111-3-CG-GG,111-3-CG-GG,,0,1,,In Stock,20,20,,72.75''W x 29''D x 29''H,No,,30114,,,,94,Yes,300,**1 Per Box**
111-3-GY-GG,111-3-GY-GG,,0,1,,In Stock,22,22,,72.75''W x 29''D x 29''H,No,,30114,,,,94,Yes,300,**1 Per Box**
111-3-WH-GG,111-3-WH-GG,,0,1,,In Stock,10,10,,72.75''W x 29''D x 29''H,No,,38654 89506,,,,94,Yes,300,**1 Per Box**
111-SET-BK-GG,111-SET-BK-GG,,0,1,,In Stock,1,1,,33.50'' - 72.75''W x 29'' - 31''D x 29''H,No,,89506 38654,,,,222,Yes,300,**Item Ships in 3 Boxes**
111-SET-BN-GG,111-SET-BN-GG,2021-02-02,1,1,2021-02-02,Back Ordered,0,0,,33.50'' - 72.75''W x 29'' - 31''D x 29''H,No,,89506 38654,,,,222,Yes,300,**Item Ships in 3 Boxes**
111-SET-CG-GG,111-SET-CG-GG,,0,1,,In Stock,20,20,,33.50'' - 72.75''W x 29'' - 31''D x 29''H,No,,30114,,,,222,Yes,300,**Item Ships in 3 Boxes**
111-SET-GY-GG,111-SET-GY-GG,,0,1,,In Stock,6,6,,33.50'' - 72.75''W x 29'' - 31''D x 29''H,No,,30114,,,,222,Yes,300,**Item Ships in 3 Boxes**
111-SET-WH-GG,111-SET-WH-GG,,0,1,,In Stock,10,10,,33.50'' - 72.75''W x 29'' - 31''D x 29''H,No,,89506 38654,,,,222,Yes,300,**Item Ships in 3 Boxes**
2-ET-ER18345-24-DB-GG,2-ET-ER18345-24-DB-GG,,0,1,,In Stock,1,1,,,No,,30114,,,,21,Yes,125,**1 Per Box**
2-ET-ER18345-24-GY-GG,2-ET-ER18345-24-GY-GG,,0,1,,In Stock,94,94,,,No,,30114,,,,21,Yes,125,**1 Per Box**
2-ET-ER18345-24-LB-GG,2-ET-ER18345-24-LB-GG,,0,1,,In Stock,1,1,,,No,,30114,,,,21,Yes,125,**1 Per Box**
2-ET-ER18345-30-DB-GG,2-ET-ER18345-30-DB-GG,,0,1,,In Stock,146,146,,,No,,30114,,,,23,Yes,125,**1 Per Box**
2-ET-ER18345-30-GY-GG,2-ET-ER18345-30-GY-GG,,0,1,,In Stock,36,36,,,No,,30114,,,,23,Yes,125,**1 Per Box**
2-ET-ER18345-30-LB-GG,2-ET-ER18345-30-LB-GG,,0,1,,In Stock,327,327,,,No,,30114,,,,23,Yes,125,**1 Per Box**
2-ET-SWVLPTO-30-BK-GG,2-ET-SWVLPTO-30-BK-GG,,1,1,,Back Ordered,0,0,,,No,,30114,,,,60,Yes,85,**1 Per Box**
2-ET-SWVLPTO-30-GG,2-ET-SWVLPTO-30-GG,,0,1,,In Stock,16,16,,,No,,30114,,,,60,Yes,85,
2-GM-103122SS-BK-GG,2-GM-103122SS-BK-GG,,0,1,,In Stock,394,394,,,No,,30114,,,,38.3,Yes,85,**1 Per Box**
2-JJ-092H-GG,2-JJ-092H-GG,,0,1,,In Stock,1,1,,,No,,30114,,,,33,No,250,**2 Per Box**
2-TLH-037-BK-GG,2-TLH-037-BK-GG,,0,1,,In Stock,573,573,,21.75''W x 23.50''D x 28.50''H,No,,30114,,,,21,Yes,250,**1 Per Box**
2-TLH-037-DK-BN-GG,2-TLH-037-DK-BN-GG,,0,1,,In Stock,1452,1452,,21.75''W x 23.50''D x 28.50''H,No,,30114,,,,21,Yes,250,**1 Per Box**
2-TLH-037-GY-GG,2-TLH-037-GY-GG,,1,1,,Back Ordered,0,0,,21.75''W x 23.50''D x 28.50''H,No,,30114,,,,21,Yes,250,**1 Per Box**
2-TLH-SC-044-B-GG,2-TLH-SC-044-B-GG,,0,1,,In Stock,3,3,,,No,,30114,,,,27,No,175,**1 Per Box**
2-XU-2424-MAR-GG,2-XU-2424-MAR-GG,,1,0,,Temporarily Out of Stock,0,0,,,No,,30114,,,,20,Yes,70,**1 Per Box**
2-XU-2430-MAR-GG,2-XU-2430-MAR-GG,,1,0,,Temporarily Out of Stock,0,0,,,No,,30114,,,,30,Yes,70,**1 Per Box**
2-XU-2430-WD-GG,2-XU-2430-WD-GG,,1,0,,Temporarily Out of Stock,0,0,,,No,,30114,,,,30,Yes,70,**1 Per Box**
2-XU-2442-MAR-GG,2-XU-2442-MAR-GG,,1,0,,Temporarily Out of Stock,0,0,,,No,,30114,,,,,Yes,,
2-XU-2442-WD-GG,2-XU-2442-WD-GG,,1,0,,Temporarily Out of Stock,0,0,,,No,,30114,,,,,Yes,70,
2-XU-3030-MAR-GG,2-XU-3030-MAR-GG,,1,0,,Temporarily Out of Stock,0,0,,,No,,30114,,,,,Yes,,
2-XU-3030-WD-GG,2-XU-3030-WD-GG,,1,0,,Temporarily Out of Stock,0,0,,,No,,30114,,,,,Yes,110,
2-XU-3042-MAR-GG,2-XU-3042-MAR-GG,,1,0,,Temporarily Out of Stock,0,0,,,No,,30114,,,,,Yes,,
2-XU-3042-WD-GG,2-XU-3042-WD-GG,,1,0,,Temporarily Out of Stock,0,0,,,No,,30114,,,,,Yes,70,
2-XU-3048-MAR-GG,2-XU-3048-MAR-GG,,1,0,,Temporarily Out of Stock,0,0,,,No,,30114,,,,,Yes,,
2-XU-3048-WD-GG,2-XU-3048-WD-GG,,1,0,,Temporarily Out of Stock,0,0,,,No,,30114,,,,,Yes,70,
2-XU-3060-MAR-GG,2-XU-3060-MAR-GG,,1,0,,Temporarily Out of Stock,0,0,,,No,,30114,,,,,Yes,70,
2-XU-3060-WD-GG,2-XU-3060-WD-GG,,1,0,,Temporarily Out of Stock,0,0,,,No,,30114,,,,,Yes,70,
2-XU-3636-MAR-GG,2-XU-3636-MAR-GG,,1,0,,Temporarily Out of Stock,0,0,,,No,,30114,,,,,Yes,,
2-XU-3636-WD-GG,2-XU-3636-WD-GG,,1,0,,Temporarily Out of Stock,0,0,,,No,,30114,,,,,Yes,110,
2-XU-4242-MAR-GG,2-XU-4242-MAR-GG,,1,0,,Temporarily Out of Stock,0,0,,,No,,30114,,,,,Yes,,
2-XU-4242-WD-GG,2-XU-4242-WD-GG,,1,0,,Temporarily Out of Stock,0,0,,,No,,30114,,,,,Yes,150,
2-XU-DG-60725-GG,2-XU-DG-60725-GG,,0,1,,In Stock,9,9,,,No,,30114,,,,15,No,175,**1 Per Box**
2-XU-DG-W0236-GG,2-XU-DG-W0236-GG,,0,1,,In Stock,24,24,,,No,,30114,,,,47,Yes,175,**1 Per Box**
2-XU-DG-W0236B-GG,2-XU-DG-W0236B-GG,,0,1,,In Stock,41,41,,,No,,30114,,,,52,Yes,175,**1 Per Box**
2-XU-DG-W0247B-GG,2-XU-DG-W0247B-GG,,0,1,,In Stock,39,39,,,No,,30114,,,,40,Yes,250,**1 Per Box**
2-XU-RD-24-MAR-GG,2-XU-RD-24-MAR-GG,,1,0,,Temporarily Out of Stock,0,0,,,No,,30114,,,,20,Yes,70,**1 Per Box**
2-XU-RD-24-WD-GG,2-XU-RD-24-WD-GG,,1,0,,Temporarily Out of Stock,0,0,,,No,,30114,,,,20,Yes,70,**1 Per Box**
2-XU-RD-30-MAR-GG,2-XU-RD-30-MAR-GG,,1,0,,Temporarily Out of Stock,0,0,,,No,,30114,,,,30,Yes,70,**1 Per Box**
2-XU-RD-30-WD-GG,2-XU-RD-30-WD-GG,,1,0,,Temporarily Out of Stock,0,0,,,No,,30114,,,,30,Yes,110,**1 Per Box**
2-XU-RD-36-MAR-GG,2-XU-RD-36-MAR-GG,,1,0,,Temporarily Out of Stock,0,0,,,No,,30114,,,,,Yes,,
2-XU-RD-36-WD-GG,2-XU-RD-36-WD-GG,,1,0,,Temporarily Out of Stock,0,0,,,No,,30114,,,,,Yes,110,
2-XU-RD-42-MAR-GG,2-XU-RD-42-MAR-GG,,1,0,,Temporarily Out of Stock,0,0,,,No,,30114,,,,,Yes,,
2-XU-RD-42-WD-GG,2-XU-RD-42-WD-GG,,1,0,,Temporarily Out of Stock,0,0,,,No,,30114,,,,,Yes,100,
2-YU-YCX-001-BLUE-GG,2-YU-YCX-001-BLUE-GG,,0,1,,In Stock,906,906,,,No,,30114,,,,12,No,175,**1 Per Box**
2-YU-YCX-001-GREEN-GG,2-YU-YCX-001-GREEN-GG,,0,1,,In Stock,822,822,,,No,,30114,,,,12,No,175,**1 Per Box**
2-YU-YCX-001-NAT-GG,2-YU-YCX-001-NAT-GG,,1,1,,Out of Stock,0,0,,,No,,30114,,,,12,No,175,**1 Per Box**
2-YU-YCX-001-RED-GG,2-YU-YCX-001-RED-GG,,0,1,,In Stock,797,797,,,No,,30114,,,,12,No,175,**1 Per Box**
2-YU-YCX-003-BLUE-GG,2-YU-YCX-003-BLUE-GG,,0,1,,In Stock,5845,5845,,12.50''W x 14''D x 20''H,No,,30114,,,,10,No,175,**1 Per Box**
2-YU-YCX-003-GREEN-GG,2-YU-YCX-003-GREEN-GG,,0,1,,In Stock,5430,5430,,12.50''W x 14''D x 20''H,No,,30114,,,,10,No,175,**1 Per Box**
2-YU-YCX-003-NAT-GG,2-YU-YCX-003-NAT-GG,,0,1,,In Stock,448,448,,,No,,30114,,,,10,No,175,**1 Per Box**
2-YU-YCX-003-RED-GG,2-YU-YCX-003-RED-GG,,0,1,,In Stock,5625,5625,,12.50''W x 14''D x 20''H,No,,30114,,,,10,No,175,**1 Per Box**
2-YU-YCX-004-BLUE-GG,2-YU-YCX-004-BLUE-GG,,0,1,,In Stock,639,639,,,No,,30114,,,,13,No,175,**1 Per Box**
2-YU-YCX-004-GREEN-GG,2-YU-YCX-004-GREEN-GG,,0,1,,In Stock,677,677,,,No,,30114,,,,13,No,175,**1 Per Box**
2-YU-YCX-004-NAT-GG,2-YU-YCX-004-NAT-GG,,0,1,,In Stock,273,273,,,No,,30114,,,,13,No,175,**1 Per Box**
2-YU-YCX-004-RED-GG,2-YU-YCX-004-RED-GG,,0,1,,In Stock,252,252,,,No,,30114,,,,13,No,175,**1 Per Box**
2-YU-YCX-005-BLUE-GG,2-YU-YCX-005-BLUE-GG,,0,1,,In Stock,608,608,,,No,,30114,,,,19,No,125,**1 Per Box**
2-YU-YCX-005-GREEN-GG,2-YU-YCX-005-GREEN-GG,,0,1,,In Stock,239,239,,,No,,30114,,,,19,No,125,**1 Per Box**
2-YU-YCX-005-RED-GG,2-YU-YCX-005-RED-GG,,0,1,,In Stock,349,349,,,No,,30114,,,,19,No,125,**1 Per Box**
2-YU-YCX-011-BLUE-GG,2-YU-YCX-011-BLUE-GG,,0,1,,In Stock,983,983,,,No,,30114,,,,10,No,175,**1 Per Box**
2-YU-YCX-011-GREEN-GG,2-YU-YCX-011-GREEN-GG,,0,1,,In Stock,625,625,,,No,,30114,,,,10,No,175,**1 Per Box**
2-YU-YCX-011-RED-GG,2-YU-YCX-011-RED-GG,,0,1,,In Stock,851,851,,,No,,30114,,,,10,No,175,**1 Per Box**
222-1-BK-GG,222-1-BK-GG,,0,1,,In Stock,1,1,,31.25''W x 30''D x 31.25''H,No,,38654 89506,,,,60,Yes,300,**1 Per Box**
222-1-BN-GG,222-1-BN-GG,,0,1,,In Stock,16,16,,31.25''W x 30''D x 31.25''H,No,,38654 89506,,,,60,Yes,300,**1 Per Box**
222-2-BK-GG,222-2-BK-GG,,0,1,,In Stock,4,4,,51''W x 30''D x 31.25''H,No,,38654 89506,,,,82,Yes,300,**1 Per Box**
222-2-BN-GG,222-2-BN-GG,,0,1,,In Stock,1,1,,51''W x 30''D x 31.25''H,No,,38654 89506,,,,82,Yes,300,**1 Per Box**
222-3-BK-GG,222-3-BK-GG,,0,1,,In Stock,4,4,,68.50''W x 30''D x 31.25''H,No,,38654 89506,,,,102,Yes,300,**1 Per Box**
222-3-BN-GG,222-3-BN-GG,,0,1,,In Stock,3,3,,68.50''W x 30''D x 31.25''H,No,,38654 89506 30114,,,,102,Yes,300,**1 Per Box**
222-SET-BK-GG,222-SET-BK-GG,2021-01-02,1,1,2021-01-02,Back Ordered,0,0,,31.25'' - 68.50''W x 30''D x 31.25''H,No,,89506 38654,,,,244,Yes,300,**Item Ships in 3 Boxes**
222-SET-BN-GG,222-SET-BN-GG,,0,1,,In Stock,1,1,,31.25'' - 68.50''W x 30''D x 31.25''H,No,,89506 38654,,,,244,Yes,300,**Item Ships in 3 Boxes**
4-ET-31320-24-BK-R-GG,4-ET-31320-24-BK-R-GG,2020-11-29,1,1,2020-11-29,Back Ordered,0,0,,,No,,30114,,,,11,Yes,175,**1 Per Box**
4-ET-31320-24-GN-R-GG,4-ET-31320-24-GN-R-GG,,0,1,,In Stock,6,6,,,No,,30114,,,,11,Yes,175,**1 Per Box**
4-ET-31320-24-SV-R-GG,4-ET-31320-24-SV-R-GG,,0,1,,In Stock,137,137,,,No,,30114,,,,11,Yes,175,**1 Per Box**
4-ET-31320-24-TL-R-GG,4-ET-31320-24-TL-R-GG,,0,1,,In Stock,5,5,,,No,,30114,,,,11,Yes,175,**1 Per Box**
4-ET-31320-30-BK-R-GG,4-ET-31320-30-BK-R-GG,,0,1,,In Stock,1326,1326,,,No,,30114,,,,11.5,Yes,175,**1 Per Box**
4-ET-31320-30-GN-R-GG,4-ET-31320-30-GN-R-GG,,0,1,,In Stock,1662,1662,,,No,,30114,,,,11.5,Yes,175,**1 Per Box**
4-ET-31320-30-SV-R-GG,4-ET-31320-30-SV-R-GG,,0,1,,In Stock,1714,1714,,,No,,30114,,,,11.5,Yes,175,**1 Per Box**
4-ET-31320-30-TL-R-GG,4-ET-31320-30-TL-R-GG,2020-11-29,1,1,2020-11-29,Back Ordered,0,0,,,No,,30114,,,,11.5,Yes,175,**1 Per Box**
4-ET-31320W-24-GN-R-GG,4-ET-31320W-24-GN-R-GG,,1,1,,Back Ordered,0,0,,,No,,30114,,,,48,No,175,**1 Per Box**
4-ET-31320W-24-SV-R-GG,4-ET-31320W-24-SV-R-GG,,0,1,,In Stock,140,140,,,No,,30114,,,,48,No,175,**1 Per Box**
4-ET-31320W-30-BK-R-GG,4-ET-31320W-30-BK-R-GG,,0,1,,In Stock,415,415,,,No,,30114,,,,55,No,175,**1 Per Box**
4-ET-31320W-30-GN-R-GG,4-ET-31320W-30-GN-R-GG,,0,1,,In Stock,415,415,,,No,,30114,,,,55,No,175,**1 Per Box**
4-ET-31320W-30-SV-R-GG,4-ET-31320W-30-SV-R-GG,,0,1,,In Stock,416,416,,,No,,30114,,,,55,No,175,**1 Per Box**
4-ET-31320W-30-TL-R-GG,4-ET-31320W-30-TL-R-GG,,0,1,,In Stock,1,1,,,No,,30114,,,,55,No,175,**1 Per Box**
4-JJ-303C-B-GG,4-JJ-303C-B-GG,,0,1,,In Stock,301,301,,,No,,30114,,,,50,Yes,175,**1 Per Box**
4-JJ-303C-G-GG,4-JJ-303C-G-GG,2020-12-21,1,1,2020-12-21,Back Ordered,0,0,,,No,,30114,,,,50,Yes,175,**1 Per Box**
4-JJ-303C-GG,4-JJ-303C-GG,,0,1,,In Stock,849,849,,,No,,30114,,,,50,Yes,175,**1 Per Box**
4-YU-YCX4-001-BLUE-GG,4-YU-YCX4-001-BLUE-GG,,0,1,,In Stock,452,452,,,No,,30114,,,,19.1,Yes,175,**1 Per Box**
4-YU-YCX4-001-GREEN-GG,4-YU-YCX4-001-GREEN-GG,,0,1,,In Stock,411,411,,,No,,30114,,,,19.1,Yes,175,**1 Per Box**
4-YU-YCX4-001-NAT-GG,4-YU-YCX4-001-NAT-GG,,1,1,,Out of Stock,0,0,,,No,,30114,,,,19.1,Yes,175,**1 Per Box**
4-YU-YCX4-001-RED-GG,4-YU-YCX4-001-RED-GG,,0,1,,In Stock,398,398,,,No,,30114,,,,19.1,Yes,175,**1 Per Box**
4-YU-YCX4-003-BLUE-GG,4-YU-YCX4-003-BLUE-GG,,0,1,,In Stock,2921,2921,,,No,,30114,,,,13,Yes,175,**1 Per Box**
4-YU-YCX4-003-GREEN-GG,4-YU-YCX4-003-GREEN-GG,,0,1,,In Stock,2713,2713,,,No,,30114,,,,13,Yes,175,**1 Per Box**
4-YU-YCX4-003-MULTI-GG,4-YU-YCX4-003-MULTI-GG,,0,1,,In Stock,896,896,,,No,,30114,,,,13,Yes,175,**1 Per Box**
4-YU-YCX4-003-NAT-GG,4-YU-YCX4-003-NAT-GG,,0,1,,In Stock,224,224,,,No,,30114,,,,13,Yes,175,**1 Per Box**
4-YU-YCX4-003-RED-GG,4-YU-YCX4-003-RED-GG,,0,1,,In Stock,2800,2800,,,No,,30114,,,,21,Yes,175,**1 Per Box**
4-YU-YCX4-004-BLUE-GG,4-YU-YCX4-004-BLUE-GG,,0,1,,In Stock,319,319,,,No,,30114,,,,21,Yes,175,**1 Per Box**
4-YU-YCX4-004-GREEN-GG,4-YU-YCX4-004-GREEN-GG,,0,1,,In Stock,338,338,,,No,,30114,,,,21,Yes,175,**1 Per Box**
4-YU-YCX4-004-MULTI-GG,4-YU-YCX4-004-MULTI-GG,,0,1,,In Stock,309,309,,,No,,30114,,,,21,Yes,175,**1 Per Box**
4-YU-YCX4-004-NAT-GG,4-YU-YCX4-004-NAT-GG,,0,1,,In Stock,136,136,,,No,,30114,,,,21,Yes,175,**1 Per Box**
4-YU-YCX4-004-RED-GG,4-YU-YCX4-004-RED-GG,,0,1,,In Stock,126,126,,,No,,30114,,,,21,Yes,175,**1 Per Box**
4-YU-YCX4-005-BLUE-GG,4-YU-YCX4-005-BLUE-GG,,0,1,,In Stock,304,304,,,No,,30114,,,,37,Yes,125,**1 Per Box**
4-YU-YCX4-005-GREEN-GG,4-YU-YCX4-005-GREEN-GG,,0,1,,In Stock,119,119,,,No,,30114,,,,37,Yes,125,**1 Per Box**
4-YU-YCX4-005-RED-GG,4-YU-YCX4-005-RED-GG,,0,1,,In Stock,174,174,,,No,,30114,,,,37,Yes,125,**1 Per Box**
4-YU-YCX4-011-BLUE-GG,4-YU-YCX4-011-BLUE-GG,,0,1,,In Stock,491,491,,,No,,30114,,,,16,Yes,125,**1 Per Box**
4-YU-YCX4-011-GREEN-GG,4-YU-YCX4-011-GREEN-GG,,0,1,,In Stock,312,312,,,No,,30114,,,,16,Yes,125,**1 Per Box**
4-YU-YCX4-011-RED-GG,4-YU-YCX4-011-RED-GG,,0,1,,In Stock,425,425,,,No,,30114,,,,16,Yes,125,**1 Per Box**
627FABRIC-BCG-SB,627FABRIC-BCG-SB,,0,1,,In Stock,4,4,,,No,,30114,,,,18,Yes,125,**4 Per Box**
801L-LF0005-BK-LEA-GG,801L-LF0005-BK-LEA-GG,,0,1,,In Stock,80,80,,33''W x 33''D x 43.50'' - 47''H,No,,30114 89506,,,,57,No,175,**1 Per Box**
801L-LF0019-BY-LEA-GG,801L-LF0019-BY-LEA-GG,,0,1,,In Stock,124,124,,33''W x 33''D x 43.50'' - 47''H,No,,30114 89506,,,,57,No,175,**1 Per Box**
802-BRN-GG,802-BRN-GG,,0,1,,In Stock,39,39,,26''W x 21.25''D x 43.75'' - 47.25''H,No,,30114 89506,,,,57,No,175,**1 Per Box**
827FABRIC-BCG-SB,827FABRIC-BCG-SB,,0,1,,In Stock,987,987,,,No,,30114,,,,18,Yes,125,**4 Per Box**
ADV-SSC-12BLK,ADV-SSC-12BLK,,0,1,,In Stock,84,84,,,No,,30114,,,,5.82,Yes,175,**5 Per Box**
ADV-SSC-12NAVY,ADV-SSC-12NAVY,,0,1,,In Stock,312,312,,,No,,30114,,,,5.82,Yes,175,**5 Per Box**
ADV-SSC-14BLK,ADV-SSC-14BLK,,0,1,,In Stock,343,343,,,No,,30114,,,,6,Yes,125,**5 Per Box**
ADV-SSC-14NAVY,ADV-SSC-14NAVY,,0,1,,In Stock,403,403,,,No,,30114,,,,6,Yes,125,**5 Per Box**
ADV-SSC-16BLK,ADV-SSC-16BLK,,0,1,,In Stock,572,572,,,No,,30114,,,,9,Yes,125,**4 Per Box**
ADV-SSC-16NAVY,ADV-SSC-16NAVY,,0,1,,In Stock,215,215,,,No,,30114,,,,9,Yes,125,**4 Per Box**
ADV-SSC-18BLK,ADV-SSC-18BLK,,0,1,,In Stock,572,572,,,No,,30114,,,,9.44,Yes,175,**4 Per Box**
ADV-SSC-18NAVY,ADV-SSC-18NAVY,,0,1,,In Stock,1500,1500,,,No,,30114,,,,9.44,Yes,175,**4 Per Box**
ADV-TITAN-18BLK,ADV-TITAN-18BLK,,0,1,,In Stock,972,972,,,No,,30114,,,,12,Yes,175,**3 Per Box**
ADV-TITAN-18NAVY,ADV-TITAN-18NAVY,,0,1,,In Stock,656,656,,,No,,30114,,,,12,Yes,175,**3 Per Box**
ADV-TITAN-TASKBLK,ADV-TITAN-TASKBLK,,0,1,,In Stock,9,9,,,No,,30114,,,,20,Yes,125,**1 Per Box**
ADV-TITAN-TASKNAVY,ADV-TITAN-TASKNAVY,,0,1,,In Stock,187,187,,,No,,30114,,,,20,Yes,125,**1 Per Box**
AM-H9460-5860-GG,AM-H9460-5860-GG,,1,1,,Out of Stock,0,0,,41.50''W x 43'' - 67''D x 43.50''H,No,,38654,,,,120,Yes,300,**Item Ships in 2 Boxes**
AM-H9460-5861-GG,AM-H9460-5861-GG,,1,1,,Out of Stock,0,0,,41.50''W x 43'' - 67''D x 43.50''H,No,,38654,,,,120,Yes,300,**Item Ships in 2 Boxes**
AM-H9460-5983-GG,AM-H9460-5983-GG,,1,1,,Out of Stock,0,0,,41.50''W x 43'' - 67''D x 43.50''H,No,,38654,,,,120,Yes,300,**Item Ships in 2 Boxes**
AM-H9560-6450-GG,AM-H9560-6450-GG,,1,1,,Back Ordered,0,0,,39''W x 43'' - 73''D x 46''H,No,,38654,,,,120,Yes,300,**Item Ships in 2 Boxes**
AW-MC309AF-BG-GG,AW-MC309AF-BG-GG,,0,1,,In Stock,316,316,,18.75''W x 18''D x 30''H,No,,30114,,,,11,Yes,85,**4 Per Box**
AW-MC309AF-BLK-GG,AW-MC309AF-BLK-GG,,0,1,,In Stock,873,873,,18.75''W x 18''D x 30''H,No,,89506 30114,,,,11,Yes,85,**4 Per Box**
AW-MC309AF-BRN-GG,AW-MC309AF-BRN-GG,,0,1,,In Stock,100,100,,18.75''W x 18''D x 30''H,No,,30114 89506,,,,11,Yes,85,**4 Per Box**
AW-MC320AF-BG-EMB-GG,AW-MC320AF-BG-EMB-GG,,1,1,,Out of Stock,0,0,,18''W x 20''D x 29.50''H,No,,30114,,,,11.6,Yes,85,**4 Per Box**
AW-MC320AF-BG-GG,AW-MC320AF-BG-GG,2020-12-08,1,1,2020-12-08,Back Ordered,0,0,,18''W x 20''D x 29.50''H,No,,30114,,,,11.6,Yes,85,**4 Per Box**
AW-MC320AF-BK-EMB-GG,AW-MC320AF-BK-EMB-GG,,1,1,,Out of Stock,0,0,,18''W x 20''D x 29.50''H,No,,30114,,,,11.6,Yes,85,**4 Per Box**
AW-MC320AF-BK-GG,AW-MC320AF-BK-GG,,0,1,,In Stock,1,1,,18''W x 20''D x 29.50''H,No,,30114,,,,11.6,Yes,85,**4 Per Box**
AW-MC320AF-GRY-EMB-GG,AW-MC320AF-GRY-EMB-GG,,1,1,,Out of Stock,0,0,,18''W x 20''D x 29.50''H,No,,30114,,,,11.6,Yes,85,**4 Per Box**
AW-MC320AF-GRY-GG,AW-MC320AF-GRY-GG,2020-12-03,1,1,2020-12-03,Back Ordered,0,0,,18''W x 20''D x 29.50''H,No,,30114,,,,11.6,Yes,85,**4 Per Box**
AW-MC320AF-NVY-EMB-GG,AW-MC320AF-NVY-EMB-GG,,1,1,,Out of Stock,0,0,,18''W x 20''D x 29.50''H,No,,30114,,,,11.6,Yes,85,**2 Per Box**
AW-MC320AF-NVY-GG,AW-MC320AF-NVY-GG,2020-12-03,1,1,2020-12-03,Back Ordered,0,0,,18''W x 20''D x 29.50''H,No,,30114,,,,11.6,Yes,85,**4 Per Box**
B-Z100-BLACK-GG,B-Z100-BLACK-GG,,0,1,,In Stock,2,2,,24''W x 27''D x 31.50''H,No,,89506 30114,,,,27.62,No,175,**1 Per Box**
B-Z100-BRN-GG,B-Z100-BRN-GG,2021-01-18,1,1,2021-01-18,Back Ordered,0,0,,24''W x 27''D x 31.50''H,No,,30114 89506,,,,27.62,No,175,**1 Per Box**
B-Z100-GY-GG,B-Z100-GY-GG,,0,1,,In Stock,45,45,,24''W x 27''D x 31.50''H,No,,30114,,,,27.62,No,175,**1 Per Box**
B-Z100-LF-0005-BK-LEA-GG,B-Z100-LF-0005-BK-LEA-GG,,0,1,,In Stock,339,339,,24''W x 27''D x 31.50''H,No,,89506,,,,27.62,No,175,**1 Per Box**
B-Z100-LF19-LEA-GG,B-Z100-LF19-LEA-GG,,0,1,,In Stock,192,192,,24''W x 27''D x 31.50''H,No,,30114 89506,,,,27.62,No,175,**1 Per Box**
B-Z100-NAVY-GG,B-Z100-NAVY-GG,,0,1,,In Stock,20,20,,24''W x 27''D x 31.50''H,No,,30114 89506,,,,27.62,No,175,**1 Per Box**
B-Z100-OXBLOOD-GG,B-Z100-OXBLOOD-GG,,0,1,,In Stock,237,237,,24''W x 27''D x 31.50''H,No,,30114,,,,27.62,No,175,**1 Per Box**
B-Z105-BLACK-GG,B-Z105-BLACK-GG,,0,1,,In Stock,1,1,,24''W x 27''D x 31.50''H,No,,30114 89506,,,,27.62,No,175,**1 Per Box**
B-Z105-BRN-GG,B-Z105-BRN-GG,,0,1,,In Stock,234,234,,24''W x 27''D x 31.50''H,No,,30114 89506,,,,27.62,No,175,**1 Per Box**
B-Z105-GY-GG,B-Z105-GY-GG,,0,1,,In Stock,15,15,,24''W x 27''D x 31.50''H,No,,30114,,,,27.62,No,175,**1 Per Box**
B-Z105-LF-0005-BK-LEA-GG,B-Z105-LF-0005-BK-LEA-GG,,0,1,,In Stock,139,139,,24''W x 27''D x 31.50''H,No,,30114 89506,,,,27.62,No,175,**1 Per Box**
B-Z105-LF19-LEA-GG,B-Z105-LF19-LEA-GG,,0,1,,In Stock,50,50,,24''W x 27''D x 31.50''H,No,,89506,,,,27.62,No,175,**1 Per Box**
B-Z105-NAVY-GG,B-Z105-NAVY-GG,,0,1,,In Stock,144,144,,24''W x 27''D x 31.50''H,No,,30114 89506,,,,27.62,No,175,**1 Per Box**
B-Z105-OXBLOOD-GG,B-Z105-OXBLOOD-GG,,0,1,,In Stock,34,34,,24''W x 27''D x 31.50''H,No,,30114 89506,,,,27.62,No,175,**1 Per Box**
BD-F002-BGE-GG,BD-F002-BGE-GG,,0,1,,In Stock,9081,9081,,18''W x 18''D x 30.5''H,No,,30114,,,,8,Yes,85,**4 Per Box**
BD-F002-BK-GG,BD-F002-BK-GG,,0,1,,In Stock,1919,1919,,18''W x 18''D x 30.5''H,No,,30114,,,,8,Yes,85,**4 Per Box**
BD-F002-GY-GG,BD-F002-GY-GG,,0,1,,In Stock,7410,7410,,18''W x 18''D x 30.5''H,No,,30114,,,,8,Yes,85,**4 Per Box**
BD-F002-RED-GG,BD-F002-RED-GG,,0,1,,In Stock,1036,1036,,18''W x 18''D x 30.5''H,No,,30114,,,,8,Yes,85,**4 Per Box**
BH-BK-HARD-VYL-GG,BH-BK-HARD-VYL-GG,,0,1,,In Stock,3110,3110,,15.50''W x 15.50''D x 2''H,No,,38654 89506,,,,3,Yes,200,**20 Per Box**
BH-BLACK-HARD-GG,BH-BLACK-HARD-GG,,0,1,,In Stock,2551,2551,,15''W x 15''D x 1.75''H,No,,89506 30114,,,,3,Yes,200,**20 Per Box**
BH-BRN-GG,BH-BRN-GG,,0,1,,In Stock,1333,1333,,16''W x 15.50''D x 1.75''H,No,,89506 38654,,,,2,Yes,250,**22 Per Box**
BH-BURG-GG,BH-BURG-GG,,0,1,,In Stock,835,835,,16''W x 15.50''D x 1.75''H,No,,89506 38654,,,,2,Yes,250,**22 Per Box**
BH-GOLD-HARD-VYL-GG,BH-GOLD-HARD-VYL-GG,,0,1,,In Stock,1227,1227,,15.50''W x 15.50''D x 2''H,No,,38654 89506,,,,3,Yes,200,**20 Per Box**
BH-H002-CRYSTAL-GG,BH-H002-CRYSTAL-GG,2020-12-15,1,1,2020-12-15,Back Ordered,0,0,,15.50''W x 18.25''D x 35''H,No,,30114,,,,9,Yes,175,**2 Per Box**
BH-H007-CRYSTAL-GG,BH-H007-CRYSTAL-GG,,0,1,,In Stock,146,146,,16''W x 19.25''D x 36''H,No,,30114,,,,9,Yes,175,**2 Per Box**
BH-ICE-CRYSTAL-GG,BH-ICE-CRYSTAL-GG,,0,1,,In Stock,2,2,,15.75''W x 20''D x 36.25''H,No,,30114,,,,12,Yes,250,**2 Per Box**
BH-IVORY-GG,BH-IVORY-GG,,0,1,,In Stock,2314,2314,,16''W x 15.50''D x 1.75''H,No,,38654 89506,,,,2,Yes,250,**22 Per Box**
BH-IVORY-HARD-GG,BH-IVORY-HARD-GG,,0,1,,In Stock,3092,3092,,15''W x 15''D x 1.75''H,No,,30114,,,,3,Yes,200,**20 Per Box**
BH-IVORY-HARD-VYL-GG,BH-IVORY-HARD-VYL-GG,,0,1,,In Stock,7300,7300,,15.50''W x 15.50''D x 2''H,No,,89506 38654,,,,3,Yes,200,**20 Per Box**
BH-K002-CRYSTAL-GG,BH-K002-CRYSTAL-GG,,0,1,,In Stock,147,147,,18''W x 21.25''D x 38''H,No,,30114,,,,9,Yes,175,**2 Per Box**
BH-SIL-HARD-VYL-GG,BH-SIL-HARD-VYL-GG,,0,1,,In Stock,2278,2278,,15.50''W x 15.50''D x 2''H,No,,89506 38654,,,,3,Yes,200,**20 Per Box**
BH-WH-HARD-GG,BH-WH-HARD-GG,,0,1,,In Stock,328,328,,15.50''W x 15.50''D x 2''H,No,,89506 38654,,,,3,Yes,200,**20 Per Box**
BH-WH-HARD-VYL-GG,BH-WH-HARD-VYL-GG,,0,1,,In Stock,3461,3461,,15.50''W x 15.50''D x 2''H,No,,38654 89506,,,,3,Yes,200,**20 Per Box**
BL-8801X-GG,BL-8801X-GG,,0,1,,In Stock,219,219,,13'' - 24.5''W x 22''D x 39'' - 41''H,No,,30114,,,,42,No,175,**1 Per Box**
BL-LB-8801X-D-BLK-GG,BL-LB-8801X-D-BLK-GG,2020-12-01,1,1,2020-12-01,Back Ordered,0,0,,,No,,30114,,,,48,No,100,
BL-LB-8801X-D-GG,BL-LB-8801X-D-GG,,0,1,,In Stock,161,161,,13'' - 26''W x 22''D x 43'' - 50.25''H,No,,30114,,,,47,No,125,**1 Per Box**
BL-LB-8803-GG,BL-LB-8803-GG,,0,1,,In Stock,35,35,,,No,,30114,,,,47,No,125,**1 Per Box**
BL-LB-8809-LEA-GG,BL-LB-8809-LEA-GG,,0,1,,In Stock,13,13,,,No,,30114,,,,47,No,125,**1 Per Box**
BL-LB-8816D-GG,BL-LB-8816D-GG,2020-12-23,1,1,2020-12-23,Back Ordered,0,0,,,No,,30114,,,,47,Yes,125,**1 Per Box**
BL-LB-8817-GG,BL-LB-8817-GG,,0,1,,In Stock,11,11,,,No,,30114,,,,47,No,125,**1 Per Box**
BL-X-5C-BK-LEA-GG,BL-X-5C-BK-LEA-GG,,0,1,,In Stock,4,4,,,No,,30114,,,,31.5,No,175,**1 Per Box**
BL-X-5C-GG,BL-X-5C-GG,2020-12-23,1,1,2020-12-23,Back Ordered,0,0,,,No,,30114,,,,31.5,No,175,**1 Per Box**
BL-X-5H-GG,BL-X-5H-GG,2020-12-01,1,1,2020-12-01,Back Ordered,0,0,,25.50''W x 24''D x 47.50'' - 52.50''H,No,,30114,,,,36.22,No,100,**1 Per Box**
BL-X-5M-BK-GG,BL-X-5M-BK-GG,,0,1,,In Stock,4979,4979,,24.50''W x 25.50''D x 37.50'' - 41.25''H,No,,30114 89506,,,,33,No,125,**1 Per Box**
BL-X-5M-BLUE-GG,BL-X-5M-BLUE-GG,,0,1,,In Stock,698,698,,,No,,30114,,,,33,No,125,**1 Per Box**
BL-X-5M-D-BK-LEA-GG,BL-X-5M-D-BK-LEA-GG,,0,1,,In Stock,535,535,,,No,,30114,,,,12,No,125,**1 Per Box**
BL-X-5M-D-BLUE-GG,BL-X-5M-D-BLUE-GG,,0,1,,In Stock,10,10,,,No,,30114,,,,12,No,125,**1 Per Box**
BL-X-5M-D-DKGY-GG,BL-X-5M-D-DKGY-GG,2020-12-19,1,1,2020-12-19,Back Ordered,0,0,,,No,,30114,,,,12,No,125,**1 Per Box**
BL-X-5M-D-GG,BL-X-5M-D-GG,,0,1,,In Stock,3656,3656,,24.50''W x 25.50''D x 43.25'' - 50.75''H,No,,30114,,,,38,No,125,**1 Per Box**