"id","code","next-available","out-of-stock","orderable","Est Arrival Date","Status","Available Quantity","available-qty","free-ship-method","dimensions","ship-alone","flat-ship-rates","origin-zip","number-of-boxes","invalid-ship-methods","upsable","ship-weight","global-free-ship-exclusion","freight-class","outbound-shipping"
111-1-BK-GG,111-1-BK-GG,,0,1,,In Stock,63,63,,33.50''W x 31''D x 29''H,No,,38654 89506,,,,54,Yes,300,**1 Per Box**
111-1-BN-GG,111-1-BN-GG,,0,1,,In Stock,10,10,,33.50''W x 31''D x 29''H,No,,38654 89506,,,,54,Yes,300,**1 Per Box**
111-1-CG-GG,111-1-CG-GG,,0,1,,In Stock,30,30,,33.50''W x 31''D x 29''H,No,,30114,,,,54,Yes,300,**1 Per Box**
111-1-GY-GG,111-1-GY-GG,,0,1,,In Stock,4,4,,33.50''W x 31''D x 29''H,No,,30114,,,,54,Yes,300,**1 Per Box**
111-1-WH-GG,111-1-WH-GG,,0,1,,In Stock,44,44,,33.50''W x 31''D x 29''H,No,,38654 89506,,,,54,Yes,300,**1 Per Box**
111-2-BK-GG,111-2-BK-GG,,0,1,,In Stock,33,33,,52''W x 29''D x 29''H,No,,38654 89506,,,,74,Yes,300,**1 Per Box**
111-2-BN-GG,111-2-BN-GG,,0,1,,In Stock,8,8,,52''W x 29''D x 29''H,No,,38654 89506,,,,74,Yes,300,**1 Per Box**
111-2-CG-GG,111-2-CG-GG,,0,1,,In Stock,26,26,,52''W x 29''D x 29''H,No,,30114,,,,74,Yes,300,**1 Per Box**
111-2-GY-GG,111-2-GY-GG,,0,1,,In Stock,22,22,,52''W x 29''D x 29''H,No,,30114,,,,74,Yes,300,**1 Per Box**
111-2-WH-GG,111-2-WH-GG,,0,1,,In Stock,50,50,,52''W x 29''D x 29''H,No,,38654 89506,,,,74,Yes,300,**1 Per Box**
111-3-BK-GG,111-3-BK-GG,,0,1,,In Stock,51,51,,72.75''W x 29''D x 29''H,No,,38654 89506,,,,94,Yes,300,**1 Per Box**
111-3-BN-GG,111-3-BN-GG,,0,1,,In Stock,8,8,,72.75''W x 29''D x 29''H,No,,38654 89506,,,,94,Yes,300,**1 Per Box**
111-3-CG-GG,111-3-CG-GG,,0,1,,In Stock,18,18,,72.75''W x 29''D x 29''H,No,,30114,,,,94,Yes,300,**1 Per Box**
111-3-GY-GG,111-3-GY-GG,,0,1,,In Stock,20,20,,72.75''W x 29''D x 29''H,No,,30114,,,,94,Yes,300,**1 Per Box**
111-3-WH-GG,111-3-WH-GG,,0,1,,In Stock,8,8,,72.75''W x 29''D x 29''H,No,,38654 89506,,,,94,Yes,300,**1 Per Box**
111-SET-BK-GG,111-SET-BK-GG,,0,1,,In Stock,23,23,,33.50'' - 72.75''W x 29'' - 31''D x 29''H,No,,89506 38654,,,,222,Yes,300,**Item Ships in 3 Boxes**
111-SET-BN-GG,111-SET-BN-GG,2021-02-02,1,1,2021-02-02,Back Ordered,0,0,,33.50'' - 72.75''W x 29'' - 31''D x 29''H,No,,89506 38654,,,,222,Yes,300,**Item Ships in 3 Boxes**
111-SET-CG-GG,111-SET-CG-GG,,0,1,,In Stock,16,16,,33.50'' - 72.75''W x 29'' - 31''D x 29''H,No,,30114,,,,222,Yes,300,**Item Ships in 3 Boxes**
111-SET-GY-GG,111-SET-GY-GG,,0,1,,In Stock,4,4,,33.50'' - 72.75''W x 29'' - 31''D x 29''H,No,,30114,,,,222,Yes,300,**Item Ships in 3 Boxes**
111-SET-WH-GG,111-SET-WH-GG,,0,1,,In Stock,8,8,,33.50'' - 72.75''W x 29'' - 31''D x 29''H,No,,89506 38654,,,,222,Yes,300,**Item Ships in 3 Boxes**
2-ET-ER18345-24-DB-GG,2-ET-ER18345-24-DB-GG,,0,1,,In Stock,891,891,,,No,,30114,,,,21,Yes,125,**1 Per Box**
2-ET-ER18345-24-GY-GG,2-ET-ER18345-24-GY-GG,,0,1,,In Stock,480,480,,,No,,30114,,,,21,Yes,125,**1 Per Box**
2-ET-ER18345-24-LB-GG,2-ET-ER18345-24-LB-GG,,0,1,,In Stock,175,175,,,No,,30114,,,,21,Yes,125,**1 Per Box**
2-ET-ER18345-30-DB-GG,2-ET-ER18345-30-DB-GG,,0,1,,In Stock,368,368,,,No,,30114,,,,23,Yes,125,**1 Per Box**
2-ET-ER18345-30-GY-GG,2-ET-ER18345-30-GY-GG,,0,1,,In Stock,349,349,,,No,,30114,,,,23,Yes,125,**1 Per Box**
2-ET-ER18345-30-LB-GG,2-ET-ER18345-30-LB-GG,,0,1,,In Stock,572,572,,,No,,30114,,,,23,Yes,125,**1 Per Box**
2-ET-SWVLPTO-30-BK-GG,2-ET-SWVLPTO-30-BK-GG,,0,1,,In Stock,865,865,,,No,,30114,,,,60,Yes,85,**1 Per Box**
2-ET-SWVLPTO-30-GG,2-ET-SWVLPTO-30-GG,,0,1,,In Stock,369,369,,,No,,30114,,,,60,Yes,85,
2-GM-103122SS-BK-GG,2-GM-103122SS-BK-GG,,0,1,,In Stock,343,343,,,No,,30114,,,,38.3,Yes,85,**1 Per Box**
2-JJ-092H-GG,2-JJ-092H-GG,2021-02-14,1,1,2021-02-14,Back Ordered,0,0,,,No,,30114,,,,33,No,250,**2 Per Box**
2-TLH-037-BGE-GG,2-TLH-037-BGE-GG,,0,1,,In Stock,207,207,,,No,,30114,,,,21,Yes,250,**1 Per Box**
2-TLH-037-BK-GG,2-TLH-037-BK-GG,,0,1,,In Stock,1411,1411,,21.75''W x 23.50''D x 28.50''H,No,,30114,,,,21,Yes,250,**1 Per Box**
2-TLH-037-DK-BN-GG,2-TLH-037-DK-BN-GG,,0,1,,In Stock,1771,1771,,21.75''W x 23.50''D x 28.50''H,No,,30114,,,,21,Yes,250,**1 Per Box**
2-TLH-037-GY-GG,2-TLH-037-GY-GG,,1,1,,Back Ordered,0,0,,21.75''W x 23.50''D x 28.50''H,No,,30114,,,,21,Yes,250,**1 Per Box**
2-TLH-SC-044-B-GG,2-TLH-SC-044-B-GG,,0,1,,In Stock,1,1,,,No,,30114,,,,27,No,175,**1 Per Box**
2-XU-2424-MAR-GG,2-XU-2424-MAR-GG,,1,0,,Temporarily Out of Stock,0,0,,,No,,30114,,,,20,Yes,70,**1 Per Box**
2-XU-2430-MAR-GG,2-XU-2430-MAR-GG,,1,0,,Temporarily Out of Stock,0,0,,,No,,30114,,,,30,Yes,70,**1 Per Box**
2-XU-2430-WD-GG,2-XU-2430-WD-GG,,1,0,,Temporarily Out of Stock,0,0,,,No,,30114,,,,30,Yes,70,**1 Per Box**
2-XU-2442-MAR-GG,2-XU-2442-MAR-GG,,1,0,,Temporarily Out of Stock,0,0,,,No,,30114,,,,,Yes,,
2-XU-2442-WD-GG,2-XU-2442-WD-GG,,1,0,,Temporarily Out of Stock,0,0,,,No,,30114,,,,,Yes,70,
2-XU-3030-MAR-GG,2-XU-3030-MAR-GG,,1,0,,Temporarily Out of Stock,0,0,,,No,,30114,,,,,Yes,,
2-XU-3030-WD-GG,2-XU-3030-WD-GG,,1,0,,Temporarily Out of Stock,0,0,,,No,,30114,,,,,Yes,110,
2-XU-3042-MAR-GG,2-XU-3042-MAR-GG,,1,0,,Temporarily Out of Stock,0,0,,,No,,30114,,,,,Yes,,
2-XU-3042-WD-GG,2-XU-3042-WD-GG,,1,0,,Temporarily Out of Stock,0,0,,,No,,30114,,,,,Yes,70,
2-XU-3048-MAR-GG,2-XU-3048-MAR-GG,,1,0,,Temporarily Out of Stock,0,0,,,No,,30114,,,,,Yes,,
2-XU-3048-WD-GG,2-XU-3048-WD-GG,,1,0,,Temporarily Out of Stock,0,0,,,No,,30114,,,,,Yes,70,
2-XU-3060-MAR-GG,2-XU-3060-MAR-GG,,1,0,,Temporarily Out of Stock,0,0,,,No,,30114,,,,,Yes,70,
2-XU-3060-WD-GG,2-XU-3060-WD-GG,,1,0,,Temporarily Out of Stock,0,0,,,No,,30114,,,,,Yes,70,
2-XU-3636-MAR-GG,2-XU-3636-MAR-GG,,1,0,,Temporarily Out of Stock,0,0,,,No,,30114,,,,,Yes,,
2-XU-3636-WD-GG,2-XU-3636-WD-GG,,1,0,,Temporarily Out of Stock,0,0,,,No,,30114,,,,,Yes,110,
2-XU-4242-MAR-GG,2-XU-4242-MAR-GG,,1,0,,Temporarily Out of Stock,0,0,,,No,,30114,,,,,Yes,,
2-XU-4242-WD-GG,2-XU-4242-WD-GG,,1,0,,Temporarily Out of Stock,0,0,,,No,,30114,,,,,Yes,150,
2-XU-DG-60725-GG,2-XU-DG-60725-GG,,0,1,,In Stock,5,5,,,No,,30114,,,,15,No,175,**1 Per Box**
2-XU-DG-W0236-GG,2-XU-DG-W0236-GG,,0,1,,In Stock,14,14,,,No,,30114,,,,47,Yes,175,**1 Per Box**
2-XU-DG-W0236B-GG,2-XU-DG-W0236B-GG,,0,1,,In Stock,29,29,,,No,,30114,,,,52,Yes,175,**1 Per Box**
2-XU-DG-W0247B-GG,2-XU-DG-W0247B-GG,,0,1,,In Stock,38,38,,,No,,30114,,,,40,Yes,250,**1 Per Box**
2-XU-RD-24-MAR-GG,2-XU-RD-24-MAR-GG,,1,0,,Temporarily Out of Stock,0,0,,,No,,30114,,,,20,Yes,70,**1 Per Box**
2-XU-RD-24-WD-GG,2-XU-RD-24-WD-GG,,1,0,,Temporarily Out of Stock,0,0,,,No,,30114,,,,20,Yes,70,**1 Per Box**
2-XU-RD-30-MAR-GG,2-XU-RD-30-MAR-GG,,1,0,,Temporarily Out of Stock,0,0,,,No,,30114,,,,30,Yes,70,**1 Per Box**
2-XU-RD-30-WD-GG,2-XU-RD-30-WD-GG,,1,0,,Temporarily Out of Stock,0,0,,,No,,30114,,,,30,Yes,110,**1 Per Box**
2-XU-RD-36-MAR-GG,2-XU-RD-36-MAR-GG,,1,0,,Temporarily Out of Stock,0,0,,,No,,30114,,,,,Yes,,
2-XU-RD-36-WD-GG,2-XU-RD-36-WD-GG,,1,0,,Temporarily Out of Stock,0,0,,,No,,30114,,,,,Yes,110,
2-XU-RD-42-MAR-GG,2-XU-RD-42-MAR-GG,,1,0,,Temporarily Out of Stock,0,0,,,No,,30114,,,,,Yes,,
2-XU-RD-42-WD-GG,2-XU-RD-42-WD-GG,,1,0,,Temporarily Out of Stock,0,0,,,No,,30114,,,,,Yes,100,
2-YU-YCX-001-BLUE-GG,2-YU-YCX-001-BLUE-GG,,0,1,,In Stock,850,850,,,No,,30114,,,,12,No,175,**1 Per Box**
2-YU-YCX-001-GREEN-GG,2-YU-YCX-001-GREEN-GG,,0,1,,In Stock,766,766,,,No,,30114,,,,12,No,175,**1 Per Box**
2-YU-YCX-001-NAT-GG,2-YU-YCX-001-NAT-GG,2021-03-06,1,1,2021-03-06,Back Ordered,0,0,,,No,,30114,,,,12,No,175,**1 Per Box**
2-YU-YCX-001-RED-GG,2-YU-YCX-001-RED-GG,,0,1,,In Stock,767,767,,,No,,30114,,,,12,No,175,**1 Per Box**
2-YU-YCX-003-BLUE-GG,2-YU-YCX-003-BLUE-GG,,0,1,,In Stock,4012,4012,,12.50''W x 14''D x 20''H,No,,30114,,,,10,No,175,**1 Per Box**
2-YU-YCX-003-GREEN-GG,2-YU-YCX-003-GREEN-GG,,0,1,,In Stock,4236,4236,,12.50''W x 14''D x 20''H,No,,30114,,,,10,No,175,**1 Per Box**
2-YU-YCX-003-NAT-GG,2-YU-YCX-003-NAT-GG,2020-12-21,1,1,2020-12-21,Back Ordered,0,0,,,No,,30114,,,,10,No,175,**1 Per Box**
2-YU-YCX-003-RED-GG,2-YU-YCX-003-RED-GG,,0,1,,In Stock,5009,5009,,12.50''W x 14''D x 20''H,No,,30114,,,,10,No,175,**1 Per Box**
2-YU-YCX-004-BLUE-GG,2-YU-YCX-004-BLUE-GG,,0,1,,In Stock,600,600,,,No,,30114,,,,13,No,175,**1 Per Box**
2-YU-YCX-004-GREEN-GG,2-YU-YCX-004-GREEN-GG,,0,1,,In Stock,664,664,,,No,,30114,,,,13,No,175,**1 Per Box**
2-YU-YCX-004-NAT-GG,2-YU-YCX-004-NAT-GG,,0,1,,In Stock,231,231,,,No,,30114,,,,13,No,175,**1 Per Box**
2-YU-YCX-004-RED-GG,2-YU-YCX-004-RED-GG,,0,1,,In Stock,211,211,,,No,,30114,,,,13,No,175,**1 Per Box**
2-YU-YCX-005-BLUE-GG,2-YU-YCX-005-BLUE-GG,,0,1,,In Stock,572,572,,,No,,30114,,,,19,No,125,**1 Per Box**
2-YU-YCX-005-GREEN-GG,2-YU-YCX-005-GREEN-GG,,0,1,,In Stock,215,215,,,No,,30114,,,,19,No,125,**1 Per Box**
2-YU-YCX-005-RED-GG,2-YU-YCX-005-RED-GG,,0,1,,In Stock,337,337,,,No,,30114,,,,19,No,125,**1 Per Box**
2-YU-YCX-011-BLUE-GG,2-YU-YCX-011-BLUE-GG,,0,1,,In Stock,935,935,,,No,,30114,,,,10,No,175,**1 Per Box**
2-YU-YCX-011-GREEN-GG,2-YU-YCX-011-GREEN-GG,,0,1,,In Stock,617,617,,,No,,30114,,,,10,No,175,**1 Per Box**
2-YU-YCX-011-RED-GG,2-YU-YCX-011-RED-GG,,0,1,,In Stock,827,827,,,No,,30114,,,,10,No,175,**1 Per Box**
222-1-BK-GG,222-1-BK-GG,,0,1,,In Stock,18,18,,31.25''W x 30''D x 31.25''H,No,,38654 89506,,,,60,Yes,300,**1 Per Box**
222-1-BN-GG,222-1-BN-GG,,0,1,,In Stock,10,10,,31.25''W x 30''D x 31.25''H,No,,38654 89506,,,,60,Yes,300,**1 Per Box**
222-2-BK-GG,222-2-BK-GG,,0,1,,In Stock,1,1,,51''W x 30''D x 31.25''H,No,,38654 89506,,,,82,Yes,300,**1 Per Box**
222-2-BN-GG,222-2-BN-GG,2021-02-07,1,1,2021-02-07,Back Ordered,0,0,,51''W x 30''D x 31.25''H,No,,38654 89506,,,,82,Yes,300,**1 Per Box**
222-3-BK-GG,222-3-BK-GG,,0,1,,In Stock,8,8,,68.50''W x 30''D x 31.25''H,No,,38654 89506,,,,102,Yes,300,**1 Per Box**
222-3-BN-GG,222-3-BN-GG,,0,1,,In Stock,2,2,,68.50''W x 30''D x 31.25''H,No,,38654 89506 30114,,,,102,Yes,300,**1 Per Box**
222-SET-BK-GG,222-SET-BK-GG,2020-12-26,1,1,2020-12-26,Back Ordered,0,0,,31.25'' - 68.50''W x 30''D x 31.25''H,No,,89506 38654,,,,244,Yes,300,**Item Ships in 3 Boxes**
222-SET-BN-GG,222-SET-BN-GG,2021-02-07,1,1,2021-02-07,Back Ordered,0,0,,31.25'' - 68.50''W x 30''D x 31.25''H,No,,89506 38654,,,,244,Yes,300,**Item Ships in 3 Boxes**
4-ET-31320-24-BK-R-GG,4-ET-31320-24-BK-R-GG,,0,1,,In Stock,180,180,,,No,,30114,,,,11,Yes,175,**1 Per Box**
4-ET-31320-24-GN-R-GG,4-ET-31320-24-GN-R-GG,,0,1,,In Stock,283,283,,,No,,30114,,,,11,Yes,175,**1 Per Box**
4-ET-31320-24-SV-R-GG,4-ET-31320-24-SV-R-GG,,0,1,,In Stock,198,198,,,No,,30114,,,,11,Yes,175,**1 Per Box**
4-ET-31320-24-TL-R-GG,4-ET-31320-24-TL-R-GG,,0,1,,In Stock,322,322,,,No,,30114,,,,11,Yes,175,**1 Per Box**
4-ET-31320-30-BK-R-GG,4-ET-31320-30-BK-R-GG,,0,1,,In Stock,717,717,,,No,,30114,,,,11.5,Yes,175,**1 Per Box**
4-ET-31320-30-GN-R-GG,4-ET-31320-30-GN-R-GG,,0,1,,In Stock,567,567,,,No,,30114,,,,11.5,Yes,175,**1 Per Box**
4-ET-31320-30-SV-R-GG,4-ET-31320-30-SV-R-GG,,0,1,,In Stock,659,659,,,No,,30114,,,,11.5,Yes,175,**1 Per Box**
4-ET-31320-30-TL-R-GG,4-ET-31320-30-TL-R-GG,,0,1,,In Stock,206,206,,,No,,30114,,,,11.5,Yes,175,**1 Per Box**
4-ET-31320W-24-BK-R-GG,4-ET-31320W-24-BK-R-GG,,0,1,,In Stock,108,108,,,No,,30114,,,,48,No,175,**1 Per Box**
4-ET-31320W-24-GN-R-GG,4-ET-31320W-24-GN-R-GG,,0,1,,In Stock,204,204,,,No,,30114,,,,48,No,175,**1 Per Box**
4-ET-31320W-24-SV-R-GG,4-ET-31320W-24-SV-R-GG,,0,1,,In Stock,110,110,,,No,,30114,,,,48,No,175,**1 Per Box**
4-ET-31320W-24-TL-R-GG,4-ET-31320W-24-TL-R-GG,,0,1,,In Stock,167,167,,,No,,30114,,,,48,No,175,**1 Per Box**
4-ET-31320W-30-BK-R-GG,4-ET-31320W-30-BK-R-GG,,0,1,,In Stock,23,23,,,No,,30114,,,,55,No,175,**1 Per Box**
4-ET-31320W-30-GN-R-GG,4-ET-31320W-30-GN-R-GG,,0,1,,In Stock,97,97,,,No,,30114,,,,55,No,175,**1 Per Box**
4-ET-31320W-30-SV-R-GG,4-ET-31320W-30-SV-R-GG,,1,1,,Back Ordered,0,0,,,No,,30114,,,,55,No,175,**1 Per Box**
4-ET-31320W-30-TL-R-GG,4-ET-31320W-30-TL-R-GG,,0,1,,In Stock,172,172,,,No,,30114,,,,55,No,175,**1 Per Box**
4-JJ-303C-B-GG,4-JJ-303C-B-GG,,0,1,,In Stock,125,125,,,No,,30114,,,,50,Yes,175,**1 Per Box**
4-JJ-303C-G-GG,4-JJ-303C-G-GG,2020-12-24,1,1,2020-12-24,Back Ordered,0,0,,,No,,30114,,,,50,Yes,175,**1 Per Box**
4-JJ-303C-GG,4-JJ-303C-GG,,0,1,,In Stock,2060,2060,,,No,,30114,,,,50,Yes,175,**1 Per Box**
4-YU-YCX4-001-BLUE-GG,4-YU-YCX4-001-BLUE-GG,,0,1,,In Stock,424,424,,,No,,30114,,,,19.1,Yes,175,**1 Per Box**
4-YU-YCX4-001-GREEN-GG,4-YU-YCX4-001-GREEN-GG,,0,1,,In Stock,382,382,,,No,,30114,,,,19.1,Yes,175,**1 Per Box**
4-YU-YCX4-001-NAT-GG,4-YU-YCX4-001-NAT-GG,2021-03-06,1,1,2021-03-06,Back Ordered,0,0,,,No,,30114,,,,19.1,Yes,175,**1 Per Box**
4-YU-YCX4-001-RED-GG,4-YU-YCX4-001-RED-GG,,0,1,,In Stock,383,383,,,No,,30114,,,,19.1,Yes,175,**1 Per Box**
4-YU-YCX4-003-BLUE-GG,4-YU-YCX4-003-BLUE-GG,,0,1,,In Stock,2005,2005,,,No,,30114,,,,13,Yes,175,**1 Per Box**
4-YU-YCX4-003-GREEN-GG,4-YU-YCX4-003-GREEN-GG,,0,1,,In Stock,2118,2118,,,No,,30114,,,,13,Yes,175,**1 Per Box**
4-YU-YCX4-003-MULTI-GG,4-YU-YCX4-003-MULTI-GG,2020-12-21,1,1,2020-12-21,Back Ordered,0,0,,,No,,30114,,,,13,Yes,175,**1 Per Box**
4-YU-YCX4-003-NAT-GG,4-YU-YCX4-003-NAT-GG,2020-12-21,1,1,2020-12-21,Back Ordered,0,0,,,No,,30114,,,,13,Yes,175,**1 Per Box**
4-YU-YCX4-003-RED-GG,4-YU-YCX4-003-RED-GG,,0,1,,In Stock,2504,2504,,,No,,30114,,,,21,Yes,175,**1 Per Box**
4-YU-YCX4-004-BLUE-GG,4-YU-YCX4-004-BLUE-GG,,0,1,,In Stock,300,300,,,No,,30114,,,,21,Yes,175,**1 Per Box**
4-YU-YCX4-004-GREEN-GG,4-YU-YCX4-004-GREEN-GG,,0,1,,In Stock,331,331,,,No,,30114,,,,21,Yes,175,**1 Per Box**
4-YU-YCX4-004-MULTI-GG,4-YU-YCX4-004-MULTI-GG,,0,1,,In Stock,270,270,,,No,,30114,,,,21,Yes,175,**1 Per Box**
4-YU-YCX4-004-NAT-GG,4-YU-YCX4-004-NAT-GG,,0,1,,In Stock,115,115,,,No,,30114,,,,21,Yes,175,**1 Per Box**
4-YU-YCX4-004-RED-GG,4-YU-YCX4-004-RED-GG,,0,1,,In Stock,105,105,,,No,,30114,,,,21,Yes,175,**1 Per Box**
4-YU-YCX4-005-BLUE-GG,4-YU-YCX4-005-BLUE-GG,,0,1,,In Stock,285,285,,,No,,30114,,,,37,Yes,125,**1 Per Box**
4-YU-YCX4-005-GREEN-GG,4-YU-YCX4-005-GREEN-GG,,0,1,,In Stock,107,107,,,No,,30114,,,,37,Yes,125,**1 Per Box**
4-YU-YCX4-005-RED-GG,4-YU-YCX4-005-RED-GG,,0,1,,In Stock,168,168,,,No,,30114,,,,37,Yes,125,**1 Per Box**
4-YU-YCX4-011-BLUE-GG,4-YU-YCX4-011-BLUE-GG,,0,1,,In Stock,467,467,,,No,,30114,,,,16,Yes,125,**1 Per Box**
4-YU-YCX4-011-GREEN-GG,4-YU-YCX4-011-GREEN-GG,,0,1,,In Stock,308,308,,,No,,30114,,,,16,Yes,125,**1 Per Box**
4-YU-YCX4-011-RED-GG,4-YU-YCX4-011-RED-GG,,0,1,,In Stock,413,413,,,No,,30114,,,,16,Yes,125,**1 Per Box**
627FABRIC-BCG-SB,627FABRIC-BCG-SB,,0,1,,In Stock,3,3,,,No,,30114,,,,18,Yes,125,**4 Per Box**
801L-LF0005-BK-LEA-GG,801L-LF0005-BK-LEA-GG,,0,1,,In Stock,53,53,,33''W x 33''D x 43.50'' - 47''H,No,,30114 89506,,,,57,No,175,**1 Per Box**
801L-LF0019-BY-LEA-GG,801L-LF0019-BY-LEA-GG,,0,1,,In Stock,98,98,,33''W x 33''D x 43.50'' - 47''H,No,,30114 89506,,,,57,No,175,**1 Per Box**
802-BRN-GG,802-BRN-GG,2021-01-26,1,1,2021-01-26,Back Ordered,0,0,,26''W x 21.25''D x 43.75'' - 47.25''H,No,,30114 89506,,,,57,No,175,**1 Per Box**
827FABRIC-BCG-SB,827FABRIC-BCG-SB,,0,1,,In Stock,979,979,,,No,,30114,,,,18,Yes,125,**4 Per Box**
ADV-SSC-12BLK,ADV-SSC-12BLK,,0,1,,In Stock,72,72,,,No,,30114,,,,5.82,Yes,175,**5 Per Box**
ADV-SSC-12NAVY,ADV-SSC-12NAVY,,0,1,,In Stock,287,287,,,No,,30114,,,,5.82,Yes,175,**5 Per Box**
ADV-SSC-14BLK,ADV-SSC-14BLK,,0,1,,In Stock,321,321,,,No,,30114,,,,6,Yes,125,**5 Per Box**
ADV-SSC-14NAVY,ADV-SSC-14NAVY,,0,1,,In Stock,371,371,,,No,,30114,,,,6,Yes,125,**5 Per Box**
ADV-SSC-16BLK,ADV-SSC-16BLK,,0,1,,In Stock,562,562,,,No,,30114,,,,9,Yes,125,**4 Per Box**
ADV-SSC-16NAVY,ADV-SSC-16NAVY,,0,1,,In Stock,142,142,,,No,,30114,,,,9,Yes,125,**4 Per Box**
ADV-SSC-18BLK,ADV-SSC-18BLK,,0,1,,In Stock,568,568,,,No,,30114,,,,9.44,Yes,175,**4 Per Box**
ADV-SSC-18NAVY,ADV-SSC-18NAVY,,0,1,,In Stock,1495,1495,,,No,,30114,,,,9.44,Yes,175,**4 Per Box**
ADV-TITAN-18BLK,ADV-TITAN-18BLK,,0,1,,In Stock,952,952,,,No,,30114,,,,12,Yes,175,**3 Per Box**
ADV-TITAN-18NAVY,ADV-TITAN-18NAVY,,0,1,,In Stock- Planned to Discontinue,604,604,,,No,,30114,,,,12,Yes,175,**3 Per Box**
ADV-TITAN-TASKBLK,ADV-TITAN-TASKBLK,,0,1,,In Stock,9,9,,,No,,30114,,,,20,Yes,125,**1 Per Box**
ADV-TITAN-TASKNAVY,ADV-TITAN-TASKNAVY,,0,1,,In Stock- Planned to Discontinue,185,185,,,No,,30114,,,,20,Yes,125,**1 Per Box**
AM-H9460-5860-GG,AM-H9460-5860-GG,,1,1,,Out of Stock,0,0,,41.50''W x 43'' - 67''D x 43.50''H,No,,38654,,,,120,Yes,300,**Item Ships in 2 Boxes**
AM-H9460-5861-GG,AM-H9460-5861-GG,,1,1,,Out of Stock,0,0,,41.50''W x 43'' - 67''D x 43.50''H,No,,38654,,,,120,Yes,300,**Item Ships in 2 Boxes**
AM-H9460-5983-GG,AM-H9460-5983-GG,,1,1,,Out of Stock,0,0,,41.50''W x 43'' - 67''D x 43.50''H,No,,38654,,,,120,Yes,300,**Item Ships in 2 Boxes**
AM-H9560-6450-GG,AM-H9560-6450-GG,,1,1,,Back Ordered,0,0,,39''W x 43'' - 73''D x 46''H,No,,38654,,,,120,Yes,300,**Item Ships in 2 Boxes**
AW-MC309AF-BG-GG,AW-MC309AF-BG-GG,,0,1,,In Stock,905,905,,18.75''W x 18''D x 30''H,No,,30114,,,,11,Yes,85,**4 Per Box**
AW-MC309AF-BLK-GG,AW-MC309AF-BLK-GG,,0,1,,In Stock,1423,1423,,18.75''W x 18''D x 30''H,No,,89506 30114,,,,11,Yes,85,**4 Per Box**
AW-MC309AF-BRN-GG,AW-MC309AF-BRN-GG,,0,1,,In Stock,1330,1330,,18.75''W x 18''D x 30''H,No,,30114 89506,,,,11,Yes,85,**4 Per Box**
AW-MC320AF-BG-EMB-GG,AW-MC320AF-BG-EMB-GG,,0,1,,In Stock,217,217,,18''W x 20''D x 29.50''H,No,,30114,,,,11.6,Yes,85,**4 Per Box**
AW-MC320AF-BG-GG,AW-MC320AF-BG-GG,,0,1,,In Stock,549,549,,18''W x 20''D x 29.50''H,No,,30114,,,,11.6,Yes,85,**4 Per Box**
AW-MC320AF-BK-EMB-GG,AW-MC320AF-BK-EMB-GG,,0,1,,In Stock,555,555,,18''W x 20''D x 29.50''H,No,,30114,,,,11.6,Yes,85,**4 Per Box**
AW-MC320AF-BK-GG,AW-MC320AF-BK-GG,,0,1,,In Stock,755,755,,18''W x 20''D x 29.50''H,No,,30114,,,,11.6,Yes,85,**4 Per Box**
AW-MC320AF-GRY-EMB-GG,AW-MC320AF-GRY-EMB-GG,,0,1,,In Stock,320,320,,18''W x 20''D x 29.50''H,No,,30114,,,,11.6,Yes,85,**4 Per Box**
AW-MC320AF-GRY-GG,AW-MC320AF-GRY-GG,,0,1,,In Stock,1265,1265,,18''W x 20''D x 29.50''H,No,,30114,,,,11.6,Yes,85,**4 Per Box**
AW-MC320AF-NVY-EMB-GG,AW-MC320AF-NVY-EMB-GG,,0,1,,In Stock,5,5,,18''W x 20''D x 29.50''H,No,,30114,,,,11.6,Yes,85,**2 Per Box**
AW-MC320AF-NVY-GG,AW-MC320AF-NVY-GG,,0,1,,In Stock,5,5,,18''W x 20''D x 29.50''H,No,,30114,,,,11.6,Yes,85,**4 Per Box**
B-Z100-BLACK-GG,B-Z100-BLACK-GG,,1,1,,Back Ordered,0,0,,24''W x 27''D x 31.50''H,No,,89506 30114,,,,27.62,No,175,**1 Per Box**
B-Z100-BRN-GG,B-Z100-BRN-GG,2021-01-26,1,1,2021-01-26,Back Ordered,0,0,,24''W x 27''D x 31.50''H,No,,30114 89506,,,,27.62,No,175,**1 Per Box**
B-Z100-GY-GG,B-Z100-GY-GG,,0,1,,In Stock,38,38,,24''W x 27''D x 31.50''H,No,,30114,,,,27.62,No,175,**1 Per Box**
B-Z100-LF-0005-BK-LEA-GG,B-Z100-LF-0005-BK-LEA-GG,,0,1,,In Stock,219,219,,24''W x 27''D x 31.50''H,No,,89506,,,,27.62,No,175,**1 Per Box**
B-Z100-LF19-LEA-GG,B-Z100-LF19-LEA-GG,,0,1,,In Stock,151,151,,24''W x 27''D x 31.50''H,No,,30114 89506,,,,27.62,No,175,**1 Per Box**
B-Z100-NAVY-GG,B-Z100-NAVY-GG,,0,1,,In Stock,2,2,,24''W x 27''D x 31.50''H,No,,30114 89506,,,,27.62,No,175,**1 Per Box**
B-Z100-OXBLOOD-GG,B-Z100-OXBLOOD-GG,,0,1,,In Stock,231,231,,24''W x 27''D x 31.50''H,No,,30114,,,,27.62,No,175,**1 Per Box**
B-Z105-BLACK-GG,B-Z105-BLACK-GG,,0,1,,In Stock,5,5,,24''W x 27''D x 31.50''H,No,,30114 89506,,,,27.62,No,175,**1 Per Box**
B-Z105-BRN-GG,B-Z105-BRN-GG,,0,1,,In Stock,184,184,,24''W x 27''D x 31.50''H,No,,30114 89506,,,,27.62,No,175,**1 Per Box**
B-Z105-GY-GG,B-Z105-GY-GG,,0,1,,In Stock,2,2,,24''W x 27''D x 31.50''H,No,,30114,,,,27.62,No,175,**1 Per Box**
B-Z105-LF-0005-BK-LEA-GG,B-Z105-LF-0005-BK-LEA-GG,,0,1,,In Stock,54,54,,24''W x 27''D x 31.50''H,No,,30114 89506,,,,27.62,No,175,**1 Per Box**
B-Z105-LF19-LEA-GG,B-Z105-LF19-LEA-GG,,0,1,,In Stock,25,25,,24''W x 27''D x 31.50''H,No,,89506,,,,27.62,No,175,**1 Per Box**
B-Z105-NAVY-GG,B-Z105-NAVY-GG,,0,1,,In Stock,133,133,,24''W x 27''D x 31.50''H,No,,30114 89506,,,,27.62,No,175,**1 Per Box**
B-Z105-OXBLOOD-GG,B-Z105-OXBLOOD-GG,,0,1,,In Stock,18,18,,24''W x 27''D x 31.50''H,No,,30114 89506,,,,27.62,No,175,**1 Per Box**
BD-F002-BGE-GG,BD-F002-BGE-GG,,0,1,,In Stock,8729,8729,,18''W x 18''D x 30.5''H,No,,30114,,,,8,Yes,85,**4 Per Box**
BD-F002-BK-GG,BD-F002-BK-GG,,0,1,,In Stock,3590,3590,,18''W x 18''D x 30.5''H,No,,30114,,,,8,Yes,85,**4 Per Box**
BD-F002-GY-GG,BD-F002-GY-GG,,0,1,,In Stock,6659,6659,,18''W x 18''D x 30.5''H,No,,30114,,,,8,Yes,85,**4 Per Box**
BD-F002-RED-GG,BD-F002-RED-GG,,0,1,,In Stock,2065,2065,,18''W x 18''D x 30.5''H,No,,30114,,,,8,Yes,85,**4 Per Box**
BH-BK-HARD-VYL-GG,BH-BK-HARD-VYL-GG,,0,1,,In Stock,2828,2828,,15.50''W x 15.50''D x 2''H,No,,38654 89506,,,,3,Yes,200,**20 Per Box**
BH-BLACK-HARD-GG,BH-BLACK-HARD-GG,,0,1,,In Stock,2523,2523,,15''W x 15''D x 1.75''H,No,,89506 30114,,,,3,Yes,200,**20 Per Box**
BH-BRN-GG,BH-BRN-GG,,0,1,,In Stock,1229,1229,,16''W x 15.50''D x 1.75''H,No,,89506 38654,,,,2,Yes,250,**22 Per Box**
BH-BURG-GG,BH-BURG-GG,,0,1,,In Stock,642,642,,16''W x 15.50''D x 1.75''H,No,,89506 38654,,,,2,Yes,250,**22 Per Box**
BH-GOLD-HARD-VYL-GG,BH-GOLD-HARD-VYL-GG,,0,1,,In Stock,853,853,,15.50''W x 15.50''D x 2''H,No,,38654 89506,,,,3,Yes,200,**20 Per Box**
BH-H002-CRYSTAL-GG,BH-H002-CRYSTAL-GG,,0,1,,In Stock,157,157,,15.50''W x 18.25''D x 35''H,No,,30114,,,,9,Yes,175,**2 Per Box**
BH-H007-CRYSTAL-GG,BH-H007-CRYSTAL-GG,,0,1,,In Stock,330,330,,16''W x 19.25''D x 36''H,No,,30114,,,,9,Yes,175,**2 Per Box**
BH-ICE-CRYSTAL-GG,BH-ICE-CRYSTAL-GG,,0,1,,In Stock,758,758,,15.75''W x 20''D x 36.25''H,No,,30114,,,,12,Yes,250,**2 Per Box**
BH-IVORY-GG,BH-IVORY-GG,,0,1,,In Stock,2082,2082,,16''W x 15.50''D x 1.75''H,No,,38654 89506,,,,2,Yes,250,**22 Per Box**
BH-IVORY-HARD-GG,BH-IVORY-HARD-GG,,0,1,,In Stock,2959,2959,,15''W x 15''D x 1.75''H,No,,30114,,,,3,Yes,200,**20 Per Box**
BH-IVORY-HARD-VYL-GG,BH-IVORY-HARD-VYL-GG,,0,1,,In Stock,6458,6458,,15.50''W x 15.50''D x 2''H,No,,89506 38654,,,,3,Yes,200,**20 Per Box**
BH-K002-CRYSTAL-GG,BH-K002-CRYSTAL-GG,,0,1,,In Stock,129,129,,18''W x 21.25''D x 38''H,No,,30114,,,,9,Yes,175,**2 Per Box**
BH-SIL-HARD-VYL-GG,BH-SIL-HARD-VYL-GG,,0,1,,In Stock,2249,2249,,15.50''W x 15.50''D x 2''H,No,,89506 38654,,,,3,Yes,200,**20 Per Box**
BH-WH-HARD-GG,BH-WH-HARD-GG,,0,1,,In Stock,324,324,,15.50''W x 15.50''D x 2''H,No,,89506 38654,,,,3,Yes,200,**20 Per Box**
BH-WH-HARD-VYL-GG,BH-WH-HARD-VYL-GG,,0,1,,In Stock,3116,3116,,15.50''W x 15.50''D x 2''H,No,,38654 89506,,,,3,Yes,200,**20 Per Box**
BL-8801X-GG,BL-8801X-GG,,0,1,,In Stock,283,283,,13'' - 24.5''W x 22''D x 39'' - 41''H,No,,30114,,,,42,No,175,**1 Per Box**
BL-LB-8801X-D-BLK-GG,BL-LB-8801X-D-BLK-GG,,0,1,,In Stock,37,37,,,No,,30114,,,,48,No,100,
BL-LB-8801X-D-GG,BL-LB-8801X-D-GG,,0,1,,In Stock,688,688,,13'' - 26''W x 22''D x 43'' - 50.25''H,No,,30114,,,,47,No,125,**1 Per Box**
BL-LB-8803-GG,BL-LB-8803-GG,,0,1,,In Stock,33,33,,,No,,30114,,,,47,No,125,**1 Per Box**
BL-LB-8809-LEA-GG,BL-LB-8809-LEA-GG,,0,1,,In Stock,9,9,,,No,,30114,,,,47,No,125,**1 Per Box**
BL-LB-8816D-GG,BL-LB-8816D-GG,2020-12-23,1,1,2020-12-23,Back Ordered,0,0,,,No,,30114,,,,47,Yes,125,**1 Per Box**
BL-LB-8817-GG,BL-LB-8817-GG,,0,1,,In Stock,5,5,,,No,,30114,,,,47,No,125,**1 Per Box**
BL-X-5C-BK-LEA-GG,BL-X-5C-BK-LEA-GG,2020-12-23,1,1,2020-12-23,Back Ordered,0,0,,,No,,30114,,,,31.5,No,175,**1 Per Box**
BL-X-5C-GG,BL-X-5C-GG,2020-12-23,1,1,2020-12-23,Back Ordered,0,0,,,No,,30114,,,,31.5,No,175,**1 Per Box**
BL-X-5H-GG,BL-X-5H-GG,,0,1,,In Stock,44,44,,25.50''W x 24''D x 47.50'' - 52.50''H,No,,30114,,,,36.22,No,100,**1 Per Box**
BL-X-5M-BK-GG,BL-X-5M-BK-GG,,0,1,,In Stock,8483,8483,,24.50''W x 25.50''D x 37.50'' - 41.25''H,No,,30114 89506,,,,33,No,125,**1 Per Box**
BL-X-5M-BLUE-GG,BL-X-5M-BLUE-GG,,0,1,,In Stock,913,913,,,No,,30114,,,,33,No,125,**1 Per Box**
BL-X-5M-D-BK-LEA-GG,BL-X-5M-D-BK-LEA-GG,,0,1,,In Stock,1090,1090,,,No,,30114,,,,12,No,125,**1 Per Box**